All pastes #244085 Raw Edit

Unnamed

public text v1 · immutable
#244085 ·published 2006-11-09 08:09 UTC
rendered paste body
(cd .libs && rm -f libfade.la && ln -s ../libfade.la libfade.la)
/bin/sh ../libtool --tag=CC   --mode=compile i686-pc-linux-gnu-gcc -DHAVE_CONFIG_H -I. -I.. -I/usr/include/libpng12 -I/usr/include/startup-notification-1.0 -I/usr/include/beryl -I/usr/include/cairo -I/usr/include/librsvg-2 -I/usr/include/glib-2.0 -I/usr/lib/glib-2.0/include -I/usr/include/gtk-2.0 -I/usr/include/glib-2.0 -I/usr/lib/glib-2.0/include -DDATADIR='"/usr/share"' -DLIBDIR='"/usr/lib"' -DALL_LINGUAS="\"\"" -DLOCALEDIR="\"/usr/share/locale\"" -DIMAGEDIR='"/usr/share/beryl"' -I../include    -O3 -march=pentium-m -pipe -fomit-frame-pointer -Wall -Wpointer-arith -Wstrict-prototypes -Wmissing-prototypes -Wmissing-declarations -Wnested-externs -fno-strict-aliasing -MT cube.lo -MD -MP -MF .deps/cube.Tpo -c -o cube.lo cube.c
 i686-pc-linux-gnu-gcc -DHAVE_CONFIG_H -I. -I.. -I/usr/include/libpng12 -I/usr/include/startup-notification-1.0 -I/usr/include/beryl -I/usr/include/cairo -I/usr/include/librsvg-2 -I/usr/include/glib-2.0 -I/usr/lib/glib-2.0/include -I/usr/include/gtk-2.0 -I/usr/include/glib-2.0 -I/usr/lib/glib-2.0/include -DDATADIR=\"/usr/share\" -DLIBDIR=\"/usr/lib\" -DALL_LINGUAS=\"\" -DLOCALEDIR=\"/usr/share/locale\" -DIMAGEDIR=\"/usr/share/beryl\" -I../include -O3 -march=pentium-m -pipe -fomit-frame-pointer -Wall -Wpointer-arith -Wstrict-prototypes -Wmissing-prototypes -Wmissing-declarations -Wnested-externs -fno-strict-aliasing -MT cube.lo -MD -MP -MF .deps/cube.Tpo -c cube.c  -fPIC -DPIC -o .libs/cube.o
cube.c: In function 'cubePaintTransformedScreen':
cube.c:1614: error: 'ScreenPaintAttrib' has no member named 'xScale'
cube.c:1614: error: 'ScreenPaintAttrib' has no member named 'yScale'
make[2]: *** [cube.lo] Fehler 1
make[2]: Leaving directory `/tmp/PORTAGE/var-tmp/portage/x11-plugins/beryl-plugins-9999/work/beryl-plugins/src'
make[1]: *** [all-recursive] Fehler 1
make[1]: Leaving directory `/tmp/PORTAGE/var-tmp/portage/x11-plugins/beryl-plugins-9999/work/beryl-plugins'
make: *** [all] Fehler 2