All pastes #243589 Raw Edit

Something

public text v1 · immutable
·published 2006-11-08 18:02 UTC
rendered paste body
root@piggyg1-laptop:/home/piggyg1/grub-0.95# make
make  all-recursive
make[1]: Entering directory `/home/piggyg1/.Trash/grub-0 (copy).95'
Making all in netboot
make[2]: Entering directory `/home/piggyg1/.Trash/grub-0 (copy).95/netboot'
make[2]: Nothing to be done for `all'.
make[2]: Leaving directory `/home/piggyg1/.Trash/grub-0 (copy).95/netboot'
Making all in stage2
make[2]: Entering directory `/home/piggyg1/.Trash/grub-0 (copy).95/stage2'
if gcc -DHAVE_CONFIG_H -I. -I. -I.. -I../stage1  -Wall -Wmissing-prototypes -Wunused -Wshadow -Wpointer-arith -falign-jumps=1 -falign-loops=1 -falign-functions=1 -Wundef -Os -fno-stack-protector -fno-builtin -nostdinc  -DSUPPORT_SERIAL=1 -DSUPPORT_HERCULES=1 -DFSYS_EXT2FS=1 -DFSYS_FAT=1 -DFSYS_FFS=1 -DFSYS_UFS2=1 -DFSYS_MINIX=1 -DFSYS_REISERFS=1 -DFSYS_VSTAFS=1 -DFSYS_JFS=1 -DFSYS_XFS=1 -DFSYS_ISO9660=1 -DUSE_MD5_PASSWORDS=1 -g -MT pre_stage2_exec-builtins.o -MD -MP -MF ".deps/pre_stage2_exec-builtins.Tpo" -c -o pre_stage2_exec-builtins.o `test -f 'builtins.c' || echo './'`builtins.c; \
        then mv -f ".deps/pre_stage2_exec-builtins.Tpo" ".deps/pre_stage2_exec-builtins.Po"; else rm -f ".deps/pre_stage2_exec-builtins.Tpo"; exit 1; fi
builtins.c: In function ‘blocklist_func’:
builtins.c:145: error: invalid storage class for function ‘disk_read_blocklist_func’
builtins.c:145: warning: no previous prototype for ‘disk_read_blocklist_func’
builtins.c: In function ‘color_func’:
builtins.c:592: error: invalid storage class for function ‘color_number’
builtins.c:592: warning: no previous prototype for ‘color_number’
builtins.c: In function ‘install_func’:
builtins.c:1751: error: invalid storage class for function ‘disk_read_savesect_func’
builtins.c:1751: warning: no previous prototype for ‘disk_read_savesect_func’
builtins.c:1767: error: invalid storage class for function ‘disk_read_blocklist_func’
builtins.c:1767: warning: no previous prototype for ‘disk_read_blocklist_func’
builtins.c: In function ‘setkey_func’:
builtins.c:3499: error: invalid storage class for function ‘find_key_code’
builtins.c:3499: warning: no previous prototype for ‘find_key_code’
builtins.c:3516: error: invalid storage class for function ‘find_ascii_code’
builtins.c:3516: warning: no previous prototype for ‘find_ascii_code’
builtins.c: In function ‘uppermem_func’:
builtins.c:4542: warning: dereferencing type-punned pointer will break strict-aliasing rules
make[2]: *** [pre_stage2_exec-builtins.o] Error 1
make[2]: Leaving directory `/home/piggyg1/.Trash/grub-0 (copy).95/stage2'
make[1]: *** [all-recursive] Error 1
make[1]: Leaving directory `/home/piggyg1/.Trash/grub-0 (copy).95'