rendered paste bodyceptions -fno-rtti -MT set_var.o -MD -MP -MF ".deps/set_var.Tpo" -c -o set_var.o set_var.cc; \
then mv -f ".deps/set_var.Tpo" ".deps/set_var.Po"; else rm -f ".deps/set_var.Tpo"; exit 1; fi
mysqld.cc:0: warning: variable tracking requested, but useless unless producing debug info
mysqld.cc:1: warning: variable tracking requested, but useless unless producing debug info
mysqld.cc: In function ‘void* handle_connections_sockets(void*)’:
mysqld.cc:4030: error: invalid conversion from ‘size_socket*’ to ‘socklen_t*’
mysqld.cc:4030: error: initializing argument 3 of ‘int accept(int, sockaddr*, socklen_t*)’
mysqld.cc:4103: error: invalid conversion from ‘size_socket*’ to ‘socklen_t*’
mysqld.cc:4103: error: initializing argument 3 of ‘int getsockname(int, sockaddr*, socklen_t*)’
make[4]: *** [mysqld.o] Error 1
make[4]: *** Waiting for unfinished jobs....
set_var.cc:0: warning: variable tracking requested, but useless unless producing debug info
set_var.cc:1: warning: variable tracking requested, but useless unless producing debug info
make[4]: Leaving directory `/var/tmp/portage/mysql-5.0.26-r1/work/mysql/sql'
make[3]: *** [all-recursive] Error 1
make[3]: Leaving directory `/var/tmp/portage/mysql-5.0.26-r1/work/mysql/sql'
make[2]: *** [all] Error 2
make[2]: Leaving directory `/var/tmp/portage/mysql-5.0.26-r1/work/mysql/sql'
make[1]: *** [all-recursive] Error 1
make[1]: Leaving directory `/var/tmp/portage/mysql-5.0.26-r1/work/mysql'
make: *** [all] Error 2
!!! ERROR: dev-db/mysql-5.0.26-r1 failed.
Call stack:
ebuild.sh, line 1546: Called dyn_compile
ebuild.sh, line 937: Called src_compile
ebuild.sh, line 1255: Called mysql_src_compile
mysql.eclass, line 469: Called die
!!! emake failed
!!! If you need support, post the topmost build error, and the call stack if relevant.
xushitop d #