All pastes #243037 Raw Edit

Untitled

public text v1 · immutable
·published 2006-11-08 00:46 UTC
rendered paste body
root@krystal:~/.xchat2/xsys-2.1.0# make
gcc -O2 -Wall -fPIC -DVER_MINOR=1 -DVER_MAJOR=2 -DVER_PATCH=0 -DVER_STRING=\"2.1.0\" -DPCIIDS=\"/usr/share/misc/pci.ids\"    -c -o parse.o parse.c
parse.c:31:24: error: pci/header.h: No existe el fichero ó directorio
En el fichero incluído de parse.c:39:
pci.h:24:21: error: pci/pci.h: No existe el fichero ó directorio
In file included from parse.c:39:
pci.h:26: error: syntax error before ‘*’ token
parse.c: En la función ‘xs_parse_sound’:
parse.c:182: error: ‘u16’ no se declaró aquí (primer uso en esta función)
parse.c:182: error: (Cada identificador no declarado solamente se reporta una vez
parse.c:182: error: para cada funcion en la que aparece.)
parse.c:182: error: syntax error before ‘class’
parse.c:186: error: ‘class’ no se declaró aquí (primer uso en esta función)
parse.c: En la función ‘xs_parse_video’:
parse.c:223: error: ‘u16’ no se declaró aquí (primer uso en esta función)
parse.c:223: error: syntax error before ‘class’
parse.c:224: error: ‘class’ no se declaró aquí (primer uso en esta función)
parse.c: En la función ‘xs_parse_ether’:
parse.c:234: error: ‘u16’ no se declaró aquí (primer uso en esta función)
parse.c:234: error: syntax error before ‘class’
parse.c:235: error: ‘class’ no se declaró aquí (primer uso en esta función)
parse.c: En la función ‘xs_parse_agpbridge’:
parse.c:245: error: ‘u16’ no se declaró aquí (primer uso en esta función)
parse.c:245: error: syntax error before ‘class’
parse.c:246: error: ‘class’ no se declaró aquí (primer uso en esta función)
make: *** [parse.o] Error 1
root@krystal:~/.xchat2/xsys-2.1.0# make install
gcc -O2 -Wall -fPIC -DVER_MINOR=1 -DVER_MAJOR=2 -DVER_PATCH=0 -DVER_STRING=\"2.1.0\" -DPCIIDS=\"/usr/share/misc/pci.ids\"    -c -o parse.o parse.c
parse.c:31:24: error: pci/header.h: No existe el fichero ó directorio
En el fichero incluído de parse.c:39:
pci.h:24:21: error: pci/pci.h: No existe el fichero ó directorio
In file included from parse.c:39:
pci.h:26: error: syntax error before ‘*’ token
parse.c: En la función ‘xs_parse_sound’:
parse.c:182: error: ‘u16’ no se declaró aquí (primer uso en esta función)
parse.c:182: error: (Cada identificador no declarado solamente se reporta una vez
parse.c:182: error: para cada funcion en la que aparece.)
parse.c:182: error: syntax error before ‘class’
parse.c:186: error: ‘class’ no se declaró aquí (primer uso en esta función)
parse.c: En la función ‘xs_parse_video’:
parse.c:223: error: ‘u16’ no se declaró aquí (primer uso en esta función)
parse.c:223: error: syntax error before ‘class’
parse.c:224: error: ‘class’ no se declaró aquí (primer uso en esta función)
parse.c: En la función ‘xs_parse_ether’:
parse.c:234: error: ‘u16’ no se declaró aquí (primer uso en esta función)
parse.c:234: error: syntax error before ‘class’
parse.c:235: error: ‘class’ no se declaró aquí (primer uso en esta función)
parse.c: En la función ‘xs_parse_agpbridge’:
parse.c:245: error: ‘u16’ no se declaró aquí (primer uso en esta función)
parse.c:245: error: syntax error before ‘class’
parse.c:246: error: ‘class’ no se declaró aquí (primer uso en esta función)
make: *** [parse.o] Error 1
root@krystal:~/.xchat2/xsys-2.1.0#