All pastes #242567 Raw Edit

Mine

public text v1 · immutable
·published 2006-11-07 12:54 UTC
rendered paste body
gcc  -pipe  -Wall -Wstrict-prototypes -Wmissing-prototypes -Wmissing-declarations -g3  -Iinclude -I../include -D_REENTRANT -D_GNU_SOURCE  -O6 -march=i686 -DZAPTEL_OPTIMIZATIONS         -fomit-frame-pointer  -fPIC   -c -o app_rxfax.o app_rxfax.c
app_rxfax.c: In function âphase_e_handlerâ:
app_rxfax.c:105: error: ât30_stats_tâ has no member named âcolumn_resolutionâ
app_rxfax.c:105: error: ât30_stats_tâ has no member named ârow_resolutionâ
app_rxfax.c:116: error: ât30_stats_tâ has no member named ârow_resolutionâ
app_rxfax.c:122: error: ât30_stats_tâ has no member named ârow_resolutionâ
app_rxfax.c: In function âphase_d_handlerâ:
app_rxfax.c:147: error: ât30_stats_tâ has no member named âcolumnsâ
app_rxfax.c:147: error: ât30_stats_tâ has no member named ârowsâ
app_rxfax.c:148: error: ât30_stats_tâ has no member named âcolumn_resolutionâ
app_rxfax.c:148: error: ât30_stats_tâ has no member named ârow_resolutionâ
app_rxfax.c: In function ârxfax_execâ:
app_rxfax.c:281: warning: passing argument 1 of âfax_initâ from incompatible pointer type
app_rxfax.c:281: error: too many arguments to function âfax_initâ
app_rxfax.c:304: warning: passing argument 1 of âfax_rxâ from incompatible pointer type
app_rxfax.c:307: warning: passing argument 1 of âfax_txâ from incompatible pointer type
app_rxfax.c:344: warning: passing argument 1 of âfax_releaseâ from incompatible pointer type
make[1]: *** [app_rxfax.o] Error 1
make[1]: Leaving directory `/usr/src/asterisk-1.2.12.1/apps'
make: *** [subdirs] Error 1