All pastes #242447 Raw Edit

Miscellany

public text v1 · immutable
·published 2006-11-07 08:07 UTC
rendered paste body
evdev.c: In function 'EvdevSwitchMode':
evdev.c:235: error: 'SendCoreEvents' undeclared (first use in this function)
evdev.c:235: error: (Each undeclared identifier is reported only once
evdev.c:235: error: for each function it appears in.)
evdev.c:236: error: 'DontSendCoreEvents' undeclared (first use in this function)make[2]: *** [evdev_drv_la-evdev.lo] Error 1
make[2]: *** Waiting for unfinished jobs....
make[2]: Leaving directory `/var/tmp/portage/xf86-input-evdev-1.1.2-r2/work/xf86-input-evdev-1.1.2/src'
make[1]: *** [all-recursive] Error 1
make[1]: Leaving directory `/var/tmp/portage/xf86-input-evdev-1.1.2-r2/work/xf86-input-evdev-1.1.2'
make: *** [all] Error 2

!!! ERROR: x11-drivers/xf86-input-evdev-1.1.2-r2 failed.
Call stack:
  ebuild.sh, line 1546:   Called dyn_compile
  ebuild.sh, line 937:   Called src_compile
  ebuild.sh, line 1255:   Called x-modular_src_compile
  x-modular.eclass, line 333:   Called x-modular_src_make
  x-modular.eclass, line 328:   Called die

!!! emake failed
!!! If you need support, post the topmost build error, and the call stack if relevant.