All pastes #242438 Raw Edit

Unnamed

public text v1 · immutable
·published 2006-11-07 07:51 UTC
rendered paste body
In file included from intern\ghost\intern\GHOST_SystemWin32.cpp:70:
intern\ghost\intern\/GHOST_WindowWin32.h:48:20: wintab.h: No such file or direct
ory
intern\ghost\intern\/GHOST_WindowWin32.h:51:20: pktdef.h: No such file or direct
ory
In file included from intern\ghost\intern\GHOST_SystemWin32.cpp:70:
intern\ghost\intern\/GHOST_WindowWin32.h:54: error: expected `)' before '*' toke
n
intern\ghost\intern\/GHOST_WindowWin32.h:54: error: expected `,' or `;' before '
*' token
intern\ghost\intern\/GHOST_WindowWin32.h:55: error: ISO C++ forbids declaration
of `HCTX' with no type
intern\ghost\intern\/GHOST_WindowWin32.h:55: error: typedef `HCTX' is initialize
d (use __typeof__ instead)
intern\ghost\intern\/GHOST_WindowWin32.h:55: error: `API' was not declared in th
is scope
intern\ghost\intern\/GHOST_WindowWin32.h:55: error: `GHOST_WIN32_WTOpen' was not
 declared in this scope
intern\ghost\intern\/GHOST_WindowWin32.h:55: error: expected `,' or `;' before '
(' token
intern\ghost\intern\/GHOST_WindowWin32.h:56: error: expected `)' before '*' toke
n
intern\ghost\intern\/GHOST_WindowWin32.h:56: error: expected `,' or `;' before '
*' token
intern\ghost\intern\/GHOST_WindowWin32.h:57: error: expected `)' before '*' toke
n
intern\ghost\intern\/GHOST_WindowWin32.h:57: error: expected `,' or `;' before '
*' token
intern\ghost\intern\GHOST_SystemWin32.cpp: In member function `virtual GHOST_TSu
ccess GHOST_SystemWin32::getCursorPosition(GHOST_TInt32&, GHOST_TInt32&) const':

intern\ghost\intern\GHOST_SystemWin32.cpp:228: warning: unused variable 'success
'
intern\ghost\intern\GHOST_SystemWin32.cpp: In static member function `static LRE
SULT GHOST_SystemWin32::s_wndProc(HWND__*, UINT, WPARAM, LPARAM)':
intern\ghost\intern\GHOST_SystemWin32.cpp:633: error: `WT_PACKET' undeclared (fi
rst use this function)
intern\ghost\intern\GHOST_SystemWin32.cpp:633: error: (Each undeclared identifie
r is reported only once for each function it appears in.)
intern\ghost\intern\GHOST_SystemWin32.cpp:636: error: `WT_CSRCHANGE' undeclared
(first use this function)
intern\ghost\intern\GHOST_SystemWin32.cpp:637: error: `WT_PROXIMITY' undeclared
(first use this function)
scons: *** [C:\bf-blender\build\win32-mingw\intern\ghost\intern\GHOST_SystemWin3
2.o] Error 1
scons: building terminated because of errors.