[root@ /hd1/asterisk/asterisk-addons-1.4.0-beta2]# gmake
gmake[1]: Entering directory `/hd1/asterisk/asterisk-addons-1.4.0-beta2'
gcc -g -c -fPIC -fPIC -o app_addon_sql_mysql.o app_addon_sql_mysql.c
app_addon_sql_mysql.c:15:22: asterisk.h: No such file or directory
app_addon_sql_mysql.c:25:25: mysql/mysql.h: No such file or directory
app_addon_sql_mysql.c:27:27: asterisk/file.h: No such file or directory
app_addon_sql_mysql.c:28:29: asterisk/logger.h: No such file or directory
app_addon_sql_mysql.c:29:30: asterisk/channel.h: No such file or directory
app_addon_sql_mysql.c:30:26: asterisk/pbx.h: No such file or directory
app_addon_sql_mysql.c:31:29: asterisk/module.h: No such file or directory
app_addon_sql_mysql.c:32:34: asterisk/linkedlists.h: No such file or directory
app_addon_sql_mysql.c:33:31: asterisk/chanvars.h: No such file or directory
app_addon_sql_mysql.c:34:27: asterisk/lock.h: No such file or directory
app_addon_sql_mysql.c:78: warning: parameter names (without types) in function declaration
app_addon_sql_mysql.c:78: warning: data definition has no type or storage class
app_addon_sql_mysql.c:89: error: syntax error before "AST_LIST_ENTRY"
app_addon_sql_mysql.c:92: error: syntax error before "_mysql_ids_head"
app_addon_sql_mysql.c:92: warning: data definition has no type or storage class
app_addon_sql_mysql.c: In function `find_identifier':
app_addon_sql_mysql.c:101: warning: assignment from incompatible pointer type
app_addon_sql_mysql.c:104: error: `LOG_WARNING' undeclared (first use in this function)
app_addon_sql_mysql.c:104: error: (Each undeclared identifier is reported only once
app_addon_sql_mysql.c:104: error: for each function it appears in.)
app_addon_sql_mysql.c:106: error: `entries' undeclared (first use in this function)
app_addon_sql_mysql.c:106: error: syntax error before '{' token
app_addon_sql_mysql.c:110: error: break statement not within loop or switch
app_addon_sql_mysql.c: At top level:
app_addon_sql_mysql.c:113: error: syntax error before "if"
gmake[1]: *** [app_addon_sql_mysql.o] Error 1
gmake[1]: Leaving directory `/hd1/asterisk/asterisk-addons-1.4.0-beta2'
gmake: *** [all] Error 2
[root@ /hd1/asterisk/asterisk-addons-1.4.0-beta2]#