All pastes #23897 Raw Edit

konq.err on opie-image

public text v1 · immutable
#23897 ·published 2005-09-25 22:40 UTC
rendered paste body
NOTE: make -j 4
 cd . && /bin/sh ./config.status Makefile 
config.status: creating Makefile
make  all-recursive
make[1]: Entering directory `/stuff/build/tmp/work/konqueror-embedded-20030705-r3/konqueror-embedded-snapshot-20030705'
Making all in konq-embed
make[2]: Entering directory `/stuff/build/tmp/work/konqueror-embedded-20030705-r3/konqueror-embedded-snapshot-20030705/konq-embed'
 cd .. && /bin/sh ./config.status konq-embed/Makefile 
config.status: creating konq-embed/Makefile
make[2]: Leaving directory `/stuff/build/tmp/work/konqueror-embedded-20030705-r3/konqueror-embedded-snapshot-20030705/konq-embed'
make[2]: Entering directory `/stuff/build/tmp/work/konqueror-embedded-20030705-r3/konqueror-embedded-snapshot-20030705/konq-embed'
Making all in dropin
make[3]: Entering directory `/stuff/build/tmp/work/konqueror-embedded-20030705-r3/konqueror-embedded-snapshot-20030705/konq-embed/dropin'
 cd ../.. && /bin/sh ./config.status konq-embed/dropin/Makefile depfiles
config.status: creating konq-embed/dropin/Makefile
config.status: executing depfiles commands
make[3]: Leaving directory `/stuff/build/tmp/work/konqueror-embedded-20030705-r3/konqueror-embedded-snapshot-20030705/konq-embed/dropin'
make[3]: Entering directory `/stuff/build/tmp/work/konqueror-embedded-20030705-r3/konqueror-embedded-snapshot-20030705/konq-embed/dropin'
Making all in .
make[4]: Entering directory `/stuff/build/tmp/work/konqueror-embedded-20030705-r3/konqueror-embedded-snapshot-20030705/konq-embed/dropin'
make[4]: Nothing to be done for `all-am'.
make[4]: Leaving directory `/stuff/build/tmp/work/konqueror-embedded-20030705-r3/konqueror-embedded-snapshot-20030705/konq-embed/dropin'
Making all in kio
make[4]: Entering directory `/stuff/build/tmp/work/konqueror-embedded-20030705-r3/konqueror-embedded-snapshot-20030705/konq-embed/dropin/kio'
 cd ../../.. && /bin/sh ./config.status konq-embed/dropin/kio/Makefile depfiles
config.status: creating konq-embed/dropin/kio/Makefile
config.status: executing depfiles commands
make[4]: Leaving directory `/stuff/build/tmp/work/konqueror-embedded-20030705-r3/konqueror-embedded-snapshot-20030705/konq-embed/dropin/kio'
make[4]: Entering directory `/stuff/build/tmp/work/konqueror-embedded-20030705-r3/konqueror-embedded-snapshot-20030705/konq-embed/dropin/kio'
Making all in kded
make[5]: Entering directory `/stuff/build/tmp/work/konqueror-embedded-20030705-r3/konqueror-embedded-snapshot-20030705/konq-embed/dropin/kio/kded'
 cd ../../../.. && /bin/sh ./config.status konq-embed/dropin/kio/kded/Makefile depfiles
config.status: creating konq-embed/dropin/kio/kded/Makefile
config.status: executing depfiles commands
make[5]: Leaving directory `/stuff/build/tmp/work/konqueror-embedded-20030705-r3/konqueror-embedded-snapshot-20030705/konq-embed/dropin/kio/kded'
make[5]: Entering directory `/stuff/build/tmp/work/konqueror-embedded-20030705-r3/konqueror-embedded-snapshot-20030705/konq-embed/dropin/kio/kded'
make[5]: Nothing to be done for `all'.
make[5]: Leaving directory `/stuff/build/tmp/work/konqueror-embedded-20030705-r3/konqueror-embedded-snapshot-20030705/konq-embed/dropin/kio/kded'
make[5]: Entering directory `/stuff/build/tmp/work/konqueror-embedded-20030705-r3/konqueror-embedded-snapshot-20030705/konq-embed/dropin/kio'
make[5]: Nothing to be done for `all-am'.
make[5]: Leaving directory `/stuff/build/tmp/work/konqueror-embedded-20030705-r3/konqueror-embedded-snapshot-20030705/konq-embed/dropin/kio'
make[4]: Leaving directory `/stuff/build/tmp/work/konqueror-embedded-20030705-r3/konqueror-embedded-snapshot-20030705/konq-embed/dropin/kio'
Making all in kparts
make[4]: Entering directory `/stuff/build/tmp/work/konqueror-embedded-20030705-r3/konqueror-embedded-snapshot-20030705/konq-embed/dropin/kparts'
 cd ../../.. && /bin/sh ./config.status konq-embed/dropin/kparts/Makefile depfiles
config.status: creating konq-embed/dropin/kparts/Makefile
config.status: executing depfiles commands
make[4]: Leaving directory `/stuff/build/tmp/work/konqueror-embedded-20030705-r3/konqueror-embedded-snapshot-20030705/konq-embed/dropin/kparts'
make[4]: Entering directory `/stuff/build/tmp/work/konqueror-embedded-20030705-r3/konqueror-embedded-snapshot-20030705/konq-embed/dropin/kparts'
make[4]: Nothing to be done for `all'.
make[4]: Leaving directory `/stuff/build/tmp/work/konqueror-embedded-20030705-r3/konqueror-embedded-snapshot-20030705/konq-embed/dropin/kparts'
Making all in khtml
make[4]: Entering directory `/stuff/build/tmp/work/konqueror-embedded-20030705-r3/konqueror-embedded-snapshot-20030705/konq-embed/dropin/khtml'
 cd ../../.. && /bin/sh ./config.status konq-embed/dropin/khtml/Makefile depfiles
config.status: creating konq-embed/dropin/khtml/Makefile
config.status: executing depfiles commands
make[4]: Leaving directory `/stuff/build/tmp/work/konqueror-embedded-20030705-r3/konqueror-embedded-snapshot-20030705/konq-embed/dropin/khtml'
make[4]: Entering directory `/stuff/build/tmp/work/konqueror-embedded-20030705-r3/konqueror-embedded-snapshot-20030705/konq-embed/dropin/khtml'
make[4]: Nothing to be done for `all'.
make[4]: Leaving directory `/stuff/build/tmp/work/konqueror-embedded-20030705-r3/konqueror-embedded-snapshot-20030705/konq-embed/dropin/khtml'
Making all in kssl
make[4]: Entering directory `/stuff/build/tmp/work/konqueror-embedded-20030705-r3/konqueror-embedded-snapshot-20030705/konq-embed/dropin/kssl'
 cd ../../.. && /bin/sh ./config.status konq-embed/dropin/kssl/Makefile depfiles
config.status: creating konq-embed/dropin/kssl/Makefile
config.status: executing depfiles commands
make[4]: Leaving directory `/stuff/build/tmp/work/konqueror-embedded-20030705-r3/konqueror-embedded-snapshot-20030705/konq-embed/dropin/kssl'
make[4]: Entering directory `/stuff/build/tmp/work/konqueror-embedded-20030705-r3/konqueror-embedded-snapshot-20030705/konq-embed/dropin/kssl'
make[4]: Nothing to be done for `all'.
make[4]: Leaving directory `/stuff/build/tmp/work/konqueror-embedded-20030705-r3/konqueror-embedded-snapshot-20030705/konq-embed/dropin/kssl'
make[3]: Leaving directory `/stuff/build/tmp/work/konqueror-embedded-20030705-r3/konqueror-embedded-snapshot-20030705/konq-embed/dropin'
Making all in kdesrc
make[3]: Entering directory `/stuff/build/tmp/work/konqueror-embedded-20030705-r3/konqueror-embedded-snapshot-20030705/konq-embed/kdesrc'
 cd ../.. && /bin/sh ./config.status konq-embed/kdesrc/Makefile 
config.status: creating konq-embed/kdesrc/Makefile
make[3]: Leaving directory `/stuff/build/tmp/work/konqueror-embedded-20030705-r3/konqueror-embedded-snapshot-20030705/konq-embed/kdesrc'
make[3]: Entering directory `/stuff/build/tmp/work/konqueror-embedded-20030705-r3/konqueror-embedded-snapshot-20030705/konq-embed/kdesrc'
Making all in kdecore
make[4]: Entering directory `/stuff/build/tmp/work/konqueror-embedded-20030705-r3/konqueror-embedded-snapshot-20030705/konq-embed/kdesrc/kdecore'
 cd ../../.. && /bin/sh ./config.status konq-embed/kdesrc/kdecore/Makefile depfiles
config.status: creating konq-embed/kdesrc/kdecore/Makefile
config.status: executing depfiles commands
make[4]: Leaving directory `/stuff/build/tmp/work/konqueror-embedded-20030705-r3/konqueror-embedded-snapshot-20030705/konq-embed/kdesrc/kdecore'
make[4]: Entering directory `/stuff/build/tmp/work/konqueror-embedded-20030705-r3/konqueror-embedded-snapshot-20030705/konq-embed/kdesrc/kdecore'
make[4]: Nothing to be done for `all'.
make[4]: Leaving directory `/stuff/build/tmp/work/konqueror-embedded-20030705-r3/konqueror-embedded-snapshot-20030705/konq-embed/kdesrc/kdecore'
Making all in kjs
make[4]: Entering directory `/stuff/build/tmp/work/konqueror-embedded-20030705-r3/konqueror-embedded-snapshot-20030705/konq-embed/kdesrc/kjs'
 cd ../../.. && /bin/sh ./config.status konq-embed/kdesrc/kjs/Makefile depfiles
config.status: creating konq-embed/kdesrc/kjs/Makefile
config.status: executing depfiles commands
make[4]: Leaving directory `/stuff/build/tmp/work/konqueror-embedded-20030705-r3/konqueror-embedded-snapshot-20030705/konq-embed/kdesrc/kjs'
make[4]: Entering directory `/stuff/build/tmp/work/konqueror-embedded-20030705-r3/konqueror-embedded-snapshot-20030705/konq-embed/kdesrc/kjs'
if /bin/sh ../../../libtool --silent --tag=CXX --mode=compile ccache arm-linux-g++ -march=armv5te -mtune=xscale -DHAVE_CONFIG_H -I. -I/stuff/build/tmp/work/konqueror-embedded-20030705-r3/konqueror-embedded-snapshot-20030705/konq-embed/kdesrc/kjs -I../../.. -I/opt/QtPalmtop/include -I/stuff/build/tmp/staging/arm-linux/qt2/include   -I/stuff/build/tmp/staging/arm-linux/include  -DQWS -D_REENTRANT   -Wnon-virtual-dtor -Wno-long-long -Wundef -Wall -pedantic -W -Wpointer-arith -Wmissing-prototypes -Wwrite-strings -ansi -D_XOPEN_SOURCE=500 -D_BSD_SOURCE -Wcast-align -Wconversion -DNDEBUG -DNO_DEBUG -O2 -I/stuff/build/tmp/staging/arm-linux/include -fexpensive-optimizations -fomit-frame-pointer -frename-registers -O2 -fpermissive -DOPIE_NO_ERASE_RECT_HACKFIX -DOPIE_NEW_MALLOC -fno-exceptions -fno-check-new -fno-rtti -D_QT_QPE_ -DQT_CLEAN_NAMESPACE -DQT_NO_COMPAT -DQT_NO_ASCII_CAST  -MT kjs.lo -MD -MP -MF ".deps/kjs.Tpo" -c -o kjs.lo kjs.cpp; \
then mv -f ".deps/kjs.Tpo" ".deps/kjs.Plo"; else rm -f ".deps/kjs.Tpo"; exit 1; fi
if /bin/sh ../../../libtool --silent --tag=CXX --mode=compile ccache arm-linux-g++ -march=armv5te -mtune=xscale -DHAVE_CONFIG_H -I. -I/stuff/build/tmp/work/konqueror-embedded-20030705-r3/konqueror-embedded-snapshot-20030705/konq-embed/kdesrc/kjs -I../../.. -I/opt/QtPalmtop/include -I/stuff/build/tmp/staging/arm-linux/qt2/include   -I/stuff/build/tmp/staging/arm-linux/include  -DQWS -D_REENTRANT   -Wnon-virtual-dtor -Wno-long-long -Wundef -Wall -pedantic -W -Wpointer-arith -Wmissing-prototypes -Wwrite-strings -ansi -D_XOPEN_SOURCE=500 -D_BSD_SOURCE -Wcast-align -Wconversion -DNDEBUG -DNO_DEBUG -O2 -I/stuff/build/tmp/staging/arm-linux/include -fexpensive-optimizations -fomit-frame-pointer -frename-registers -O2 -fpermissive -DOPIE_NO_ERASE_RECT_HACKFIX -DOPIE_NEW_MALLOC -fno-exceptions -fno-check-new -fno-rtti -D_QT_QPE_ -DQT_CLEAN_NAMESPACE -DQT_NO_COMPAT -DQT_NO_ASCII_CAST  -MT grammar.lo -MD -MP -MF ".deps/grammar.Tpo" -c -o grammar.lo grammar.cpp; \
then mv -f ".deps/grammar.Tpo" ".deps/grammar.Plo"; else rm -f ".deps/grammar.Tpo"; exit 1; fi
if /bin/sh ../../../libtool --silent --tag=CXX --mode=compile ccache arm-linux-g++ -march=armv5te -mtune=xscale -DHAVE_CONFIG_H -I. -I/stuff/build/tmp/work/konqueror-embedded-20030705-r3/konqueror-embedded-snapshot-20030705/konq-embed/kdesrc/kjs -I../../.. -I/opt/QtPalmtop/include -I/stuff/build/tmp/staging/arm-linux/qt2/include   -I/stuff/build/tmp/staging/arm-linux/include  -DQWS -D_REENTRANT   -Wnon-virtual-dtor -Wno-long-long -Wundef -Wall -pedantic -W -Wpointer-arith -Wmissing-prototypes -Wwrite-strings -ansi -D_XOPEN_SOURCE=500 -D_BSD_SOURCE -Wcast-align -Wconversion -DNDEBUG -DNO_DEBUG -O2 -I/stuff/build/tmp/staging/arm-linux/include -fexpensive-optimizations -fomit-frame-pointer -frename-registers -O2 -fpermissive -DOPIE_NO_ERASE_RECT_HACKFIX -DOPIE_NEW_MALLOC -fno-exceptions -fno-check-new -fno-rtti -D_QT_QPE_ -DQT_CLEAN_NAMESPACE -DQT_NO_COMPAT -DQT_NO_ASCII_CAST  -MT lexer.lo -MD -MP -MF ".deps/lexer.Tpo" -c -o lexer.lo lexer.cpp; \
then mv -f ".deps/lexer.Tpo" ".deps/lexer.Plo"; else rm -f ".deps/lexer.Tpo"; exit 1; fi
if /bin/sh ../../../libtool --silent --tag=CXX --mode=compile ccache arm-linux-g++ -march=armv5te -mtune=xscale -DHAVE_CONFIG_H -I. -I/stuff/build/tmp/work/konqueror-embedded-20030705-r3/konqueror-embedded-snapshot-20030705/konq-embed/kdesrc/kjs -I../../.. -I/opt/QtPalmtop/include -I/stuff/build/tmp/staging/arm-linux/qt2/include   -I/stuff/build/tmp/staging/arm-linux/include  -DQWS -D_REENTRANT   -Wnon-virtual-dtor -Wno-long-long -Wundef -Wall -pedantic -W -Wpointer-arith -Wmissing-prototypes -Wwrite-strings -ansi -D_XOPEN_SOURCE=500 -D_BSD_SOURCE -Wcast-align -Wconversion -DNDEBUG -DNO_DEBUG -O2 -I/stuff/build/tmp/staging/arm-linux/include -fexpensive-optimizations -fomit-frame-pointer -frename-registers -O2 -fpermissive -DOPIE_NO_ERASE_RECT_HACKFIX -DOPIE_NEW_MALLOC -fno-exceptions -fno-check-new -fno-rtti -D_QT_QPE_ -DQT_CLEAN_NAMESPACE -DQT_NO_COMPAT -DQT_NO_ASCII_CAST  -MT nodes.lo -MD -MP -MF ".deps/nodes.Tpo" -c -o nodes.lo nodes.cpp; \
then mv -f ".deps/nodes.Tpo" ".deps/nodes.Plo"; else rm -f ".deps/nodes.Tpo"; exit 1; fi
cc1plus: warning: command line option "-Wmissing-prototypes" is valid for C/ObjC but not for C++
In file included from /stuff/build/tmp/staging/arm-linux/include/stdio.h:28,
                 from kjs.cpp:21:
/stuff/build/tmp/staging/arm-linux/include/features.h:265:5: warning: "_FORTIFY_SOURCE" is not defined
In file included from /stuff/build/tmp/staging/arm-linux/include/features.h:308,
                 from /stuff/build/tmp/staging/arm-linux/include/stdio.h:28,
                 from kjs.cpp:21:
/stuff/build/tmp/staging/arm-linux/include/sys/cdefs.h:264:6: warning: "__USE_FORTIFY_LEVEL" is not defined
In file included from kjs.cpp:21:
/stuff/build/tmp/staging/arm-linux/include/stdio.h:831:5: warning: "__USE_FORTIFY_LEVEL" is not defined
In file included from kjs.cpp:22:
/stuff/build/tmp/staging/arm-linux/include/string.h:420:6: warning: "__USE_FORTIFY_LEVEL" is not defined
kjs.h:39: warning: extra ';'
ustring.h:33: warning: extra ';'
ustring.h: In member function 'unsigned char& KJS::UCharReference::low() const':
ustring.h:157: error: cannot bind packed field '(+ KJS::UCharReference::ref())->KJS::UChar::lo' to 'unsigned char&'
ustring.h: In member function 'unsigned char& KJS::UCharReference::high() const':
ustring.h:161: error: cannot bind packed field '(+ KJS::UCharReference::ref())->KJS::UChar::hi' to 'unsigned char&'
ustring.h: At global scope:
ustring.h:417: warning: extra ';'
object.h:638: warning: extra ';'
types.h:352: warning: extra ';'
function.h:132: warning: extra ';'
internal.h:403: warning: extra ';'
collector.h:97: warning: extra ';'
kjs.cpp:150: warning: extra ';'
cc1plus: warning: command line option "-Wmissing-prototypes" is valid for C/ObjC but not for C++
make[4]: *** [kjs.lo] Error 1
make[4]: *** Waiting for unfinished jobs....
In file included from /stuff/build/tmp/staging/arm-linux/include/sys/types.h:27,
                 from ../../../config.h:523,
                 from lexer.cpp:22:
/stuff/build/tmp/staging/arm-linux/include/features.h:265:5: warning: "_FORTIFY_SOURCE" is not defined
In file included from /stuff/build/tmp/staging/arm-linux/include/features.h:308,
                 from /stuff/build/tmp/staging/arm-linux/include/sys/types.h:27,
                 from ../../../config.h:523,
                 from lexer.cpp:22:
/stuff/build/tmp/staging/arm-linux/include/sys/cdefs.h:264:6: warning: "__USE_FORTIFY_LEVEL" is not defined
In file included from lexer.cpp:27:
/stuff/build/tmp/staging/arm-linux/include/stdio.h:831:5: warning: "__USE_FORTIFY_LEVEL" is not defined
In file included from lexer.cpp:28:
/stuff/build/tmp/staging/arm-linux/include/string.h:420:6: warning: "__USE_FORTIFY_LEVEL" is not defined
cc1plus: warning: command line option "-Wmissing-prototypes" is valid for C/ObjC but not for C++
In file included from /stuff/build/tmp/staging/arm-linux/include/sys/types.h:27,
                 from ../../../config.h:523,
                 from grammar.y:23:
/stuff/build/tmp/staging/arm-linux/include/features.h:265:5: warning: kjs.h:39: warning: extra ';'
In file included from /stuff/build/tmp/staging/arm-linux/include/features.h:308,
                 from /stuff/build/tmp/staging/arm-linux/include/sys/types.h:27,
                 from ../../../config.h:523,
                 from grammar.y:23:
/stuff/build/tmp/staging/arm-linux/include/sys/cdefs.h:264:6: warning: "__USE_FORTIFY_LEVEL" is not defined
ustring.h: In member function 'unsigned char& KJS::UCharReference::low() const':
ustring.h:157: error: cannot bind packed field '(+ KJS::UCharReference::ref())->KJS::UChar::lo' to 'unsigned char&'
ustring.h: In member function 'unsigned char& KJS::UCharReference::high() const':
ustring.h:161: error: cannot bind packed field '(+ KJS::UCharReference::ref())->KJS::UChar::hi' to 'unsigned char&'
ustring.h: At global scope:
ustring.h:417: warning: extra ';'
In file included from grammar.y:25:
/stuff/build/tmp/staging/arm-linux/include/string.h:420:6: warning: "__USE_FORTIFY_LEVEL" is not defined
object.h:638: warning: extra ';'
types.h:352: warning: extra ';'
function.h:132: warning: extra ';'
In file included from grammar.y:91:
/stuff/build/tmp/staging/arm-linux/include/stdio.h:831:5: warning: "__USE_FORTIFY_LEVEL" is not defined
internal.h:403: warning: extra ';'
debugger.h:148: warning: extra ';'
kjs.h:39: warning: extra ';'
ustring.h:33: warning: extra ';'
ustring.h: In member function 'unsigned char& KJS::UCharReference::low() const':
ustring.h:157: error: cannot bind packed field '(+ KJS::UCharReference::ref())->KJS::UChar::lo' to 'unsigned char&'
ustring.h: In member function 'unsigned char& KJS::UCharReference::high() const':
ustring.h:161: error: cannot bind packed field '(+ KJS::UCharReference::ref())->KJS::UChar::hi' to 'unsigned char&'
ustring.h: At global scope:
ustring.h:417: warning: extra ';'
object.h:638: warning: extra ';'
nodes.h:787: warning: extra ';'
lexer.h:132: warning: extra ';'
lookup.h:78: warning: extra ';'
lexer.lut.h:77: warning: extra ';'
types.h:352: warning: extra ';'
function.h:132: warning: extra ';'
internal.h:403: warning: extra ';'
debugger.h:148: warning: extra ';'
cc1plus: warning: command line option "-Wmissing-prototypes" is valid for C/ObjC but not for C++
make[4]: *** [lexer.lo] Error 1
In file included from /stuff/build/tmp/staging/arm-linux/include/sys/types.h:27,
                 from ../../../config.h:523,
                 from internal.h:25,
                 from nodes.h:24,
                 from nodes.cpp:21:
/stuff/build/tmp/staging/arm-linux/include/features.h:265:5: warning: "_FORTIFY_SOURCE" is not defined
In file included from /stuff/build/tmp/staging/arm-linux/include/features.h:308,
                 from /stuff/build/tmp/staging/arm-linux/include/sys/types.h:27,
                 from ../../../config.h:523,
                 from internal.h:25,
                 from nodes.h:24,
                 from nodes.cpp:21:
/stuff/build/tmp/staging/arm-linux/include/sys/cdefs.h:264:6: warning: "__USE_FORTIFY_LEVEL" is not defined
In file included from nodes.cpp:24:
/stuff/build/tmp/staging/arm-linux/include/stdio.h:831:5: warning: "__USE_FORTIFY_LEVEL" is not defined
nodes.h:787: warning: extra ';'
lexer.h:132: warning: extra ';'
kjs.h:39: warning: extra ';'
ustring.h:33: warning: extra ';'
ustring.h: In member function 'unsigned char& KJS::UCharReference::low() const':
ustring.h:157: error: cannot bind packed field '(+ KJS::UCharReference::ref())->KJS::UChar::lo' to 'unsigned char&'
ustring.h: In member function 'unsigned char& KJS::UCharReference::high() const':
ustring.h:161: error: cannot bind packed field '(+ KJS::UCharReference::ref())->KJS::UChar::hi' to 'unsigned char&'
ustring.h: At global scope:
ustring.h:417: warning: extra ';'
object.h:638: warning: extra ';'
types.h:352: warning: extra ';'
function.h:132: warning: extra ';'
internal.h:403: warning: extra ';'
debugger.h:148: warning: extra ';'
make[4]: *** [grammar.lo] Error 1
make[3]: *** [all-recursive] Error 1
make[3]: Leaving directory `/stuff/build/tmp/work/konqueror-embedded-20030705-r3/konqueror-embedded-snapshot-20030705/konq-embed/kdesrc'
make[2]: *** [all-recursive] Error 1
make[2]: Leaving directory `/stuff/build/tmp/work/konqueror-embedded-20030705-r3/konqueror-embedded-snapshot-20030705/konq-embed'
make[1]: *** [all-recursive] Error 1
make[1]: Leaving directory `/stuff/build/tmp/work/konqueror-embedded-20030705-r3/konqueror-embedded-snapshot-20030705'
make: *** [all] Error 2
FATAL: oe_runmake failed
nodes.h:787: warning: extra ';'
lexer.h:132: warning: extra ';'
operations.h:65: warning: extra ';'
regexp_object.h:50: warning: extra ';'