All pastes #238094 Raw Edit

Anonymous

public text v1 · immutable
·published 2006-11-04 21:21 UTC
rendered paste body
  CC      arch/um/os-Linux/process.o
arch/um/os-Linux/process.c:142: error: expected declaration specifiers or ‘...’ before ‘getpid’
arch/um/os-Linux/process.c:144: warning: return type defaults to ‘int’
arch/um/os-Linux/process.c: In function ‘_syscall0’:
arch/um/os-Linux/process.c:145: error: expected ‘=’, ‘,’, ‘;’, ‘asm’ or ‘__attribute__’ before ‘{’ token
arch/um/os-Linux/process.c:150: error: expected ‘=’, ‘,’, ‘;’, ‘asm’ or ‘__attribute__’ before ‘{’ token
arch/um/os-Linux/process.c:156: error: expected ‘=’, ‘,’, ‘;’, ‘asm’ or ‘__attribute__’ before ‘{’ token
arch/um/os-Linux/process.c:171: error: expected ‘=’, ‘,’, ‘;’, ‘asm’ or ‘__attribute__’ before ‘{’ token
arch/um/os-Linux/process.c:181: error: expected ‘=’, ‘,’, ‘;’, ‘asm’ or ‘__attribute__’ before ‘{’ token
arch/um/os-Linux/process.c:191: error: expected ‘=’, ‘,’, ‘;’, ‘asm’ or ‘__attribute__’ before ‘{’ token
arch/um/os-Linux/process.c:203: error: expected ‘=’, ‘,’, ‘;’, ‘asm’ or ‘__attribute__’ before ‘{’ token
arch/um/os-Linux/process.c:224: error: expected ‘=’, ‘,’, ‘;’, ‘asm’ or ‘__attribute__’ before ‘{’ token
arch/um/os-Linux/process.c:142: error: parameter name omitted
arch/um/os-Linux/process.c:234: error: expected ‘{’ at end of input
make[1]: *** [arch/um/os-Linux/process.o] Error 1
make: *** [arch/um/os-Linux] Error 2