awk: cmd. line:1: fatal: cannot open file `/lib/modules/2.6.16.21-0.25-debug/build/include/linux/version.h' for reading (Ingen slik fil eller filkatalog)
gcc -I/lib/modules/`uname -r`/build/include -c -Wall -Wstrict-prototypes -Wno-trigraphs -O2 -fomit-frame-pointer -fno-strict-aliasing -fno-common -pipe -DMODVERSIONS -DMODULE -D__KERNEL__ -o acer_acpi.o acer_acpi.c
In file included from /usr/include/asm/pda.h:4,
from /usr/include/asm-x86_64/thread_info.h:14,
from /usr/include/asm/thread_info.h:4,
from /usr/include/linux/thread_info.h:21,
from /usr/include/linux/preempt.h:10,
from /usr/include/linux/spinlock.h:52,
from /usr/include/linux/capability.h:45,
from /usr/include/linux/sched.h:7,
from /usr/include/linux/module.h:10,
from acer_acpi.c:41:
/usr/include/asm-x86_64/pda.h:28: error: CONFIG_X86_L1_CACHE_SHIFT undeclared here (not in a function)
/usr/include/asm-x86_64/pda.h:28: error: requested alignment is not a constant
In file included from /usr/include/asm/spinlock.h:4,
from /usr/include/linux/spinlock.h:89,
from /usr/include/linux/capability.h:45,
from /usr/include/linux/sched.h:7,
from /usr/include/linux/module.h:10,
from acer_acpi.c:41:
/usr/include/asm-x86_64/spinlock.h: In function __raw_spin_lock:
/usr/include/asm-x86_64/spinlock.h:42: error: expected : or ) before KBUILD_BASENAME
/usr/include/asm-x86_64/spinlock.h: In function __raw_read_lock:
/usr/include/asm-x86_64/spinlock.h:96: error: expected : or ) before KBUILD_BASENAME
/usr/include/asm-x86_64/spinlock.h:96: error: expected expression before else
/usr/include/asm-x86_64/spinlock.h: In function __raw_write_lock:
/usr/include/asm-x86_64/spinlock.h:101: error: expected : or ) before KBUILD_BASENAME
/usr/include/asm-x86_64/spinlock.h:101: error: expected expression before else
In file included from /usr/include/asm/processor.h:4,
from /usr/include/asm-x86_64/timex.h:14,
from /usr/include/asm/timex.h:4,
from /usr/include/linux/timex.h:61,
from /usr/include/linux/sched.h:11,
from /usr/include/linux/module.h:10,
from acer_acpi.c:41:
/usr/include/asm-x86_64/processor.h: At top level:
/usr/include/asm-x86_64/processor.h:225: error: requested alignment is not a constant
In file included from /usr/include/linux/sched.h:12,
from /usr/include/linux/module.h:10,
from acer_acpi.c:41:
/usr/include/linux/jiffies.h:33:3: error: #error You lose.
/usr/include/linux/jiffies.h:204:31: error: division by zero in #if
/usr/include/linux/jiffies.h:204:31: error: division by zero in #if
/usr/include/linux/jiffies.h:204:31: error: division by zero in #if
/usr/include/linux/jiffies.h:204:31: error: division by zero in #if
/usr/include/linux/jiffies.h:204:31: error: division by zero in #if
/usr/include/linux/jiffies.h:204:31: error: division by zero in #if
/usr/include/linux/jiffies.h:204:31: error: division by zero in #if
/usr/include/linux/jiffies.h:204:31: error: division by zero in #if
/usr/include/linux/jiffies.h:204:31: error: division by zero in #if
/usr/include/linux/jiffies.h:204:31: error: division by zero in #if
/usr/include/linux/jiffies.h:204:31: error: division by zero in #if
/usr/include/linux/jiffies.h:204:31: error: division by zero in #if
/usr/include/linux/jiffies.h:204:31: error: division by zero in #if
/usr/include/linux/jiffies.h:204:31: error: division by zero in #if
/usr/include/linux/jiffies.h:204:31: error: division by zero in #if
/usr/include/linux/jiffies.h:204:31: error: division by zero in #if
/usr/include/linux/jiffies.h:248:46: error: division by zero in #if
In file included from /usr/include/linux/sched.h:12,
from /usr/include/linux/module.h:10,
from acer_acpi.c:41:
/usr/include/linux/jiffies.h: In function jiffies_to_msecs:
/usr/include/linux/jiffies.h:253: error: CONFIG_HZ undeclared (first use in this function)
/usr/include/linux/jiffies.h:253: error: (Each undeclared identifier is reported only once
/usr/include/linux/jiffies.h:253: error: for each function it appears in.)
/usr/include/linux/jiffies.h:259:46: error: division by zero in #if
/usr/include/linux/jiffies.h: In function jiffies_to_usecs:
/usr/include/linux/jiffies.h:264: error: CONFIG_HZ undeclared (first use in this function)
/usr/include/linux/jiffies.h:272:46: error: division by zero in #if
/usr/include/linux/jiffies.h: In function msecs_to_jiffies:
/usr/include/linux/jiffies.h:277: error: CONFIG_HZ undeclared (first use in this function)
/usr/include/linux/jiffies.h:285:46: error: division by zero in #if
/usr/include/linux/jiffies.h: In function usecs_to_jiffies:
/usr/include/linux/jiffies.h:290: error: CONFIG_HZ undeclared (first use in this function)
/usr/include/linux/jiffies.h: In function timespec_to_jiffies:
/usr/include/linux/jiffies.h:309: error: CONFIG_HZ undeclared (first use in this function)
/usr/include/linux/jiffies.h:311: error: SHIFT_HZ undeclared (first use in this function)
/usr/include/linux/jiffies.h: In function jiffies_to_timespec:
/usr/include/linux/jiffies.h:328: error: CONFIG_HZ undeclared (first use in this function)
/usr/include/linux/jiffies.h: In function timeval_to_jiffies:
/usr/include/linux/jiffies.h:350: error: SHIFT_HZ undeclared (first use in this function)
/usr/include/linux/jiffies.h:350: error: CONFIG_HZ undeclared (first use in this function)
/usr/include/linux/jiffies.h: In function jiffies_to_timeval:
/usr/include/linux/jiffies.h:366: error: CONFIG_HZ undeclared (first use in this function)
/usr/include/linux/jiffies.h:379:6: error: division by zero in #if
/usr/include/linux/jiffies.h:379:6: error: division by zero in #if
/usr/include/linux/jiffies.h:379:6: error: division by zero in #if
/usr/include/linux/jiffies.h:379:6: error: division by zero in #if
/usr/include/linux/jiffies.h:379:6: error: division by zero in #if
/usr/include/linux/jiffies.h:379:6: error: division by zero in #if
/usr/include/linux/jiffies.h:379:6: error: division by zero in #if
/usr/include/linux/jiffies.h:379:6: error: division by zero in #if
/usr/include/linux/jiffies.h:379:6: error: division by zero in #if
/usr/include/linux/jiffies.h:379:6: error: division by zero in #if
/usr/include/linux/jiffies.h:379:6: error: division by zero in #if
/usr/include/linux/jiffies.h:379:6: error: division by zero in #if
/usr/include/linux/jiffies.h:379:6: error: division by zero in #if
/usr/include/linux/jiffies.h:379:6: error: division by zero in #if
/usr/include/linux/jiffies.h:379:6: error: division by zero in #if
/usr/include/linux/jiffies.h:379:6: error: division by zero in #if
/usr/include/linux/jiffies.h: In function jiffies_to_clock_t:
/usr/include/linux/jiffies.h:380: error: CONFIG_HZ undeclared (first use in this function)
/usr/include/linux/jiffies.h: In function clock_t_to_jiffies:
/usr/include/linux/jiffies.h:391: error: CONFIG_HZ undeclared (first use in this function)
/usr/include/linux/jiffies.h:410:6: error: division by zero in #if
/usr/include/linux/jiffies.h:410:6: error: division by zero in #if
/usr/include/linux/jiffies.h:410:6: error: division by zero in #if
/usr/include/linux/jiffies.h:410:6: error: division by zero in #if
/usr/include/linux/jiffies.h:410:6: error: division by zero in #if
/usr/include/linux/jiffies.h:410:6: error: division by zero in #if
/usr/include/linux/jiffies.h:410:6: error: division by zero in #if
/usr/include/linux/jiffies.h:410:6: error: division by zero in #if
/usr/include/linux/jiffies.h:410:6: error: division by zero in #if
/usr/include/linux/jiffies.h:410:6: error: division by zero in #if
/usr/include/linux/jiffies.h:410:6: error: division by zero in #if
/usr/include/linux/jiffies.h:410:6: error: division by zero in #if
/usr/include/linux/jiffies.h:410:6: error: division by zero in #if
/usr/include/linux/jiffies.h:410:6: error: division by zero in #if
/usr/include/linux/jiffies.h:410:6: error: division by zero in #if
/usr/include/linux/jiffies.h:410:6: error: division by zero in #if
/usr/include/linux/jiffies.h: In function jiffies_64_to_clock_t:
/usr/include/linux/jiffies.h:411: error: CONFIG_HZ undeclared (first use in this function)
In file included from /usr/include/linux/sched.h:15,
from /usr/include/linux/module.h:10,
from acer_acpi.c:41:
/usr/include/linux/cpumask.h: At top level:
/usr/include/linux/cpumask.h:88: error: CONFIG_NR_CPUS undeclared here (not in a function)
In file included from /usr/include/linux/rwsem.h:27,
from /usr/include/asm-x86_64/semaphore.h:43,
from /usr/include/asm/semaphore.h:4,
from /usr/include/linux/sched.h:20,
from /usr/include/linux/module.h:10,
from acer_acpi.c:41:
/usr/include/asm/rwsem.h:6:2: warning: #warning rwsem.h is not supported on X86-64
In file included from /usr/include/asm/semaphore.h:4,
from /usr/include/linux/sched.h:20,
from /usr/include/linux/module.h:10,
from acer_acpi.c:41:
/usr/include/asm-x86_64/semaphore.h: In function down:
/usr/include/asm-x86_64/semaphore.h:112: error: expected : or ) before KBUILD_BASENAME
/usr/include/asm-x86_64/semaphore.h: In function down_interruptible:
/usr/include/asm-x86_64/semaphore.h:137: error: expected : or ) before KBUILD_BASENAME
/usr/include/asm-x86_64/semaphore.h: In function down_trylock:
/usr/include/asm-x86_64/semaphore.h:161: error: expected : or ) before KBUILD_BASENAME
/usr/include/asm-x86_64/semaphore.h: In function up:
/usr/include/asm-x86_64/semaphore.h:184: error: expected : or ) before KBUILD_BASENAME
In file included from /usr/include/asm/smp.h:4,
from /usr/include/linux/smp.h:19,
from /usr/include/linux/sched.h:26,
from /usr/include/linux/module.h:10,
from acer_acpi.c:41:
/usr/include/asm-x86_64/smp.h: In function hard_smp_processor_id:
/usr/include/asm-x86_64/smp.h:78: error: APIC_BASE undeclared (first use in this function)
/usr/include/asm-x86_64/smp.h:78: error: APIC_ID undeclared (first use in this function)
/usr/include/asm-x86_64/smp.h: In function cpu_present_to_apicid:
/usr/include/asm-x86_64/smp.h:113: error: BAD_APICID undeclared (first use in this function)
/usr/include/asm-x86_64/smp.h: In function logical_smp_processor_id:
/usr/include/asm-x86_64/smp.h:136: error: APIC_BASE undeclared (first use in this function)
/usr/include/asm-x86_64/smp.h:136: error: APIC_LDR undeclared (first use in this function)
In file included from /usr/include/linux/gfp.h:4,
from /usr/include/linux/slab.h:15,
from /usr/include/linux/percpu.h:5,
from /usr/include/linux/sched.h:34,
from /usr/include/linux/module.h:10,
from acer_acpi.c:41:
/usr/include/linux/mmzone.h: At top level:
/usr/include/linux/mmzone.h:41: error: requested alignment is not a constant
/usr/include/linux/mmzone.h:64: error: requested alignment is not a constant
/usr/include/linux/mmzone.h:249: error: requested alignment is not a constant
In file included from /usr/include/linux/sched.h:37,
from /usr/include/linux/module.h:10,
from acer_acpi.c:41:
/usr/include/linux/rcupdate.h:69: error: requested alignment is not a constant
/usr/include/linux/rcupdate.h:72: error: requested alignment is not a constant
In file included from /usr/include/linux/module.h:10,
from acer_acpi.c:41:
/usr/include/linux/sched.h:309: error: field mmap_sem has incomplete type
In file included from /usr/include/linux/module.h:19,
from acer_acpi.c:41:
/usr/include/linux/kobject.h:167: error: field rwsem has incomplete type
In file included from /usr/include/linux/fs.h:299,
from /usr/include/linux/proc_fs.h:6,
from acer_acpi.c:44:
/usr/include/linux/quota.h:290: error: field dqptr_sem has incomplete type
In file included from /usr/include/linux/proc_fs.h:6,
from acer_acpi.c:44:
/usr/include/linux/fs.h:486: error: field i_alloc_sem has incomplete type
In file included from /usr/include/linux/proc_fs.h:6,
from acer_acpi.c:44:
/usr/include/linux/fs.h:820: error: field s_umount has incomplete type
acer_acpi.c:49:31: error: acpi/acpi_drivers.h: Ingen slik fil eller filkatalog
acer_acpi.c:91: error: expected specifier-qualifier-list before acpi_handle
acer_acpi.c: In function is_valid_acpi_path:
acer_acpi.c:99: error: acpi_handle undeclared (first use in this function)
acer_acpi.c:99: error: expected ; before handle
acer_acpi.c:100: error: acpi_status undeclared (first use in this function)
acer_acpi.c:100: error: expected ; before status
acer_acpi.c:102: error: status undeclared (first use in this function)
acer_acpi.c:102: warning: implicit declaration of function acpi_get_handle
acer_acpi.c:102: error: handle undeclared (first use in this function)
acer_acpi.c:103: warning: implicit declaration of function ACPI_FAILURE
acer_acpi.c: At top level:
acer_acpi.c:107: error: expected =, ,, ;, asm or __attribute__ before WMAB_execute
acer_acpi.c: In function write_mled:
acer_acpi.c:200: warning: implicit declaration of function WMAB_execute
acer_acpi.c: At top level:
acer_acpi.c:281: warning: type defaults to int in declaration of acpi_status
acer_acpi.c:281: error: expected , or ; before add_proc_entries
acer_acpi.c:301: warning: type defaults to int in declaration of acpi_status
acer_acpi.c:301: error: expected , or ; before remove_proc_entries
acer_acpi.c:314: error: expected ) before handle
acer_acpi.c: In function acpi_acerkeys_add:
acer_acpi.c:329: warning: statement with no effect
acer_acpi.c:329: error: expected ; before status
acer_acpi.c:338: error: struct acer_hotk has no member named handle
acer_acpi.c:338: error: dereferencing pointer to incomplete type
acer_acpi.c:339: warning: implicit declaration of function acpi_device_name
acer_acpi.c:339: warning: passing argument 1 of __builtin_strcpy makes pointer from integer without a cast
acer_acpi.c:340: warning: implicit declaration of function acpi_device_class
acer_acpi.c:340: warning: passing argument 1 of __builtin_strcpy makes pointer from integer without a cast
acer_acpi.c:341: warning: implicit declaration of function acpi_driver_data
acer_acpi.c:341: error: invalid lvalue in assignment
acer_acpi.c:344: error: status undeclared (first use in this function)
acer_acpi.c:344: warning: implicit declaration of function acpi_install_notify_handler
acer_acpi.c:344: error: struct acer_hotk has no member named handle
acer_acpi.c:344: error: ACPI_SYSTEM_NOTIFY undeclared (first use in this function)
acer_acpi.c:345: error: acer_acerkeys_notify undeclared (first use in this function)
acer_acpi.c: In function acpi_acerkeys_remove:
acer_acpi.c:354: warning: statement with no effect
acer_acpi.c:354: error: expected ; before status
acer_acpi.c:359: warning: cast to pointer from integer of different size
acer_acpi.c:361: error: status undeclared (first use in this function)
acer_acpi.c:361: warning: implicit declaration of function acpi_remove_notify_handler
acer_acpi.c:361: error: struct acer_hotk has no member named handle
acer_acpi.c:361: error: ACPI_SYSTEM_NOTIFY undeclared (first use in this function)
acer_acpi.c:362: error: acer_acerkeys_notify undeclared (first use in this function)
acer_acpi.c: At top level:
acer_acpi.c:370: error: variable acpi_acerkeys has initializer but incomplete type
acer_acpi.c:371: error: unknown field name specified in initializer
acer_acpi.c:371: warning: excess elements in struct initializer
acer_acpi.c:371: warning: (near initialization for acpi_acerkeys)
acer_acpi.c:372: error: unknown field class specified in initializer
acer_acpi.c:372: warning: excess elements in struct initializer
acer_acpi.c:372: warning: (near initialization for acpi_acerkeys)
acer_acpi.c:373: error: unknown field ids specified in initializer
acer_acpi.c:373: warning: excess elements in struct initializer
acer_acpi.c:373: warning: (near initialization for acpi_acerkeys)
acer_acpi.c:374: error: unknown field ops specified in initializer
acer_acpi.c:374: error: extra brace group at end of initializer
acer_acpi.c:374: error: (near initialization for acpi_acerkeys)
acer_acpi.c:377: warning: excess elements in struct initializer
acer_acpi.c:377: warning: (near initialization for acpi_acerkeys)
acer_acpi.c: In function acer_acpi_init:
acer_acpi.c:384: warning: statement with no effect
acer_acpi.c:384: error: expected ; before status
acer_acpi.c:387: error: acpi_disabled undeclared (first use in this function)
acer_acpi.c:399: error: status undeclared (first use in this function)
acer_acpi.c:405: error: acpi_root_dir undeclared (first use in this function)
acer_acpi.c:407: error: AE_ERROR undeclared (first use in this function)
acer_acpi.c:410: warning: implicit declaration of function add_proc_entries
acer_acpi.c:415: warning: implicit declaration of function ACPI_SUCCESS
acer_acpi.c:416: warning: implicit declaration of function acpi_bus_register_driver
acer_acpi.c:418: warning: implicit declaration of function remove_proc_entries
acer_acpi.c: In function acer_acpi_exit:
acer_acpi.c:432: warning: implicit declaration of function acpi_bus_unregister_driver
make: *** [acer_acpi.o] Error 1
hackass:/home/sinax/acer_acpi-0.3 #