All pastes #237686 Raw Edit

ufobugfxcampaign

public text v1 · immutable
·published 2006-11-04 18:27 UTC
rendered paste body
Compiler: Default compiler
Building Makefile: "F:\svn ufoai\build\projects\Makefile.win"
Führt  make... aus
make.exe -f "F:\svn ufoai\build\projects\Makefile.win" all
gcc.exe -D__DEBUG__ -c ../../src/tools/campaign_editor/src/callbacks.c -o ../../src/tools/campaign_editor/src/callbacks.o -I"f:/Dev-Cpp/include"  -DPACKAGE_DATA_DIR="." -DPACKAGE="campaign_editor"   -fexceptions -g3

../../src/tools/campaign_editor/src/callbacks.c:30:21: gtk/gtk.h: No such file or directory
In file included from ../../src/tools/campaign_editor/src/callbacks.c:33:
../../src/tools/campaign_editor/src/callbacks.h:28: error: syntax error before '*' token
../../src/tools/campaign_editor/src/callbacks.h:29: error: syntax error before '*' token
../../src/tools/campaign_editor/src/callbacks.h:30: error: syntax error before '*' token
../../src/tools/campaign_editor/src/callbacks.h:31: error: syntax error before '*' token

../../src/tools/campaign_editor/src/callbacks.h:32: error: syntax error before '*' token
../../src/tools/campaign_editor/src/callbacks.h:33: error: syntax error before '*' token
../../src/tools/campaign_editor/src/callbacks.h:34: error: syntax error before '*' token

In file included from ../../src/tools/campaign_editor/src/callbacks.c:34:
../../src/tools/campaign_editor/src/interface.h:37: error: syntax error before '*' token
../../src/tools/campaign_editor/src/interface.h:37: warning: data definition has no type or storage class

../../src/tools/campaign_editor/src/interface.h:38: error: syntax error before '*' token
../../src/tools/campaign_editor/src/interface.h:38: warning: data definition has no type or storage class
../../src/tools/campaign_editor/src/interface.h:39: error: syntax error before '*' token
../../src/tools/campaign_editor/src/interface.h:39: warning: data definition has no type or storage class
../../src/tools/campaign_editor/src/interface.h:41: error: syntax error before '*' token
../../src/tools/campaign_editor/src/interface.h:41: error: syntax error before "GtkWidget"

../../src/tools/campaign_editor/src/interface.h:41: warning: data definition has no type or storage class
../../src/tools/campaign_editor/src/interface.h:43: error: syntax error before '*' token
../../src/tools/campaign_editor/src/interface.h:43: warning: data definition has no type or storage class

../../src/tools/campaign_editor/src/interface.h:44: error: syntax error before '*' token
../../src/tools/campaign_editor/src/interface.h:44: warning: data definition has no type or storage class
../../src/tools/campaign_editor/src/interface.h:45: error: syntax error before '*' token
../../src/tools/campaign_editor/src/interface.h:45: warning: data definition has no type or storage class
../../src/tools/campaign_editor/src/interface.h:47: error: syntax error before '*' token
../../src/tools/campaign_editor/src/interface.h:47: warning: data definition has no type or storage class

In file included from ../../src/tools/campaign_editor/src/callbacks.c:35:
../../src/tools/campaign_editor/src/support.h:74: error: syntax error before '*' token
../../src/tools/campaign_editor/src/support.h:74: error: syntax error before '*' token
../../src/tools/campaign_editor/src/support.h:74: warning: data definition has no type or storage class
../../src/tools/campaign_editor/src/support.h:78: error: syntax error before '*' token
../../src/tools/campaign_editor/src/support.h:86: error: syntax error before '*' token
../../src/tools/campaign_editor/src/support.h:86: error: syntax error before '*' token
../../src/tools/campaign_editor/src/support.h:86: warning: data definition has no type or storage class
../../src/tools/campaign_editor/src/support.h:89: error: syntax error before '*' token
../../src/tools/campaign_editor/src/support.h:89: error: syntax error before '*' token
../../src/tools/campaign_editor/src/support.h:89: warning: data definition has no type or storage class
../../src/tools/campaign_editor/src/support.h:92: error: syntax error before '*' token
../../src/tools/campaign_editor/src/support.h:99: error: syntax error before "format"
../../src/tools/campaign_editor/src/support.h:99: error: syntax error before numeric constant

In file included from ../../src/tools/campaign_editor/src/callbacks.c:37:
../../src/tools/campaign_editor/src/campaign.h:2: error: syntax error before '*' token
../../src/tools/campaign_editor/src/campaign.h:3: error: syntax error before '*' token
../../src/tools/campaign_editor/src/callbacks.c:44: error: syntax error before '*' token
../../src/tools/campaign_editor/src/callbacks.c:52: error: syntax error before '*' token
../../src/tools/campaign_editor/src/callbacks.c:62: error: syntax error before '*' token
../../src/tools/campaign_editor/src/callbacks.c: In function `mission_save':
../../src/tools/campaign_editor/src/callbacks.c:64: error: `GtkTextBuffer' undeclared (first use in this function)
../../src/tools/campaign_editor/src/callbacks.c:64: error: (Each undeclared identifier is reported only once
../../src/tools/campaign_editor/src/callbacks.c:64: error: for each function it appears in.)
../../src/tools/campaign_editor/src/callbacks.c:64: error: `txtbuf' undeclared (first use in this function)
../../src/tools/campaign_editor/src/callbacks.c:92: error: `button' undeclared (first use in this function)
../../src/tools/campaign_editor/src/callbacks.c:92: error: syntax error before "gchar"
../../src/tools/campaign_editor/src/callbacks.c: At top level:
../../src/tools/campaign_editor/src/callbacks.c:126: error: syntax error before '*' token
../../src/tools/campaign_editor/src/callbacks.c: In function `button_press_event':
../../src/tools/campaign_editor/src/callbacks.c:130: error: `event' undeclared (first use in this function)
../../src/tools/campaign_editor/src/callbacks.c: At top level:
../../src/tools/campaign_editor/src/callbacks.c:151: error: syntax error before '*' token

../../src/tools/campaign_editor/src/callbacks.c:160: error: syntax error before '*' token
../../src/tools/campaign_editor/src/callbacks.c:170: error: syntax error before '*' token

make.exe: *** [../../src/tools/campaign_editor/src/callbacks.o] Error 1

Ausführung beendet