In file included from ltdl.c:129:
ltdl.h:209: error: syntax error before "size"
ltdl.h:210: error: syntax error before "size_t"
ltdl.c:213: error: syntax error before "size"
ltdl.c:214: error: syntax error before "size_t"
ltdl.c:220: error: syntax error before "size"
ltdl.c:221: error: syntax error before "size_t"
ltdl.c:222: error: syntax error before "size_t"
ltdl.c:223: error: syntax error before "size_t"
ltdl.c:318:1: warning: "strchr" redefined
In file included from /usr/include/string.h:417,
from ltdl.c:51:
/usr/include/bits/string2.h:396:1: warning: this is the location of the previous definition
ltdl.c:380: error: syntax error before "size_t"
ltdl.c: In function `rpl_memcpy':
ltdl.c:386: error: syntax error before "size_t"
ltdl.c:390: error: `size_t' undeclared (first use in this function)
ltdl.c:390: error: syntax error before "i"
ltdl.c:392: error: `i' undeclared (first use in this function)
ltdl.c: At top level:
ltdl.c:406: error: syntax error before "size_t"
ltdl.c: In function `rpl_memmove':
ltdl.c:412: error: syntax error before "size_t"
ltdl.c:416: error: `size_t' undeclared (first use in this function)
ltdl.c:416: error: syntax error before "i"
ltdl.c:419: error: `i' undeclared (first use in this function)
ltdl.c: At top level:
ltdl.c:569: error: syntax error before "size_t"
ltdl.c: In function `rpl_argz_append':
ltdl.c:575: error: syntax error before "size_t"
ltdl.c:577: error: syntax error before "size_t"
ltdl.c:579: error: `size_t' undeclared (first use in this function)
ltdl.c:579: error: syntax error before "argz_len"
ltdl.c:591: error: `argz_len' undeclared (first use in this function)
ltdl.c:591: error: invalid type argument of `unary *'
ltdl.c:594: error: `ENOMEM' undeclared (first use in this function)
ltdl.c:597: error: invalid type argument of `unary *'
ltdl.c:601: error: invalid type argument of `unary *'
ltdl.c: At top level:
ltdl.c:611: error: syntax error before "size_t"
ltdl.c: In function `rpl_argz_create_sep':
ltdl.c:619: error: syntax error before "size_t"
ltdl.c:621: error: `size_t' undeclared (first use in this function)
ltdl.c:621: error: syntax error before "argz_len"
ltdl.c:630: error: `argz_len' undeclared (first use in this function)
ltdl.c:638: error: `ENOMEM' undeclared (first use in this function)
ltdl.c:664: error: invalid type argument of `unary *'
ltdl.c: At top level:
ltdl.c:674: error: syntax error before "size_t"
ltdl.c: In function `rpl_argz_insert':
ltdl.c:680: error: syntax error before "size_t"
ltdl.c:700: error: `size_t' undeclared (first use in this function)
ltdl.c:700: error: syntax error before "entry_len"
ltdl.c:703: error: `argz_len' undeclared (first use in this function)
ltdl.c:706: error: `ENOMEM' undeclared (first use in this function)
ltdl.c:710: error: `offset' undeclared (first use in this function)
ltdl.c:715: error: `entry_len' undeclared (first use in this function)
ltdl.c:715: error: invalid type argument of `unary *'
ltdl.c:720: error: invalid type argument of `unary *'
ltdl.c: At top level:
ltdl.c:731: error: syntax error before "size_t"
ltdl.c: In function `rpl_argz_next':
ltdl.c:737: error: syntax error before "size_t"
ltdl.c: At top level:
ltdl.c:776: error: syntax error before "size_t"
ltdl.c: In function `rpl_argz_stringify':
ltdl.c:782: error: syntax error before "size_t"
ltdl.c: At top level:
ltdl.c:1017: error: syntax error before "size_t"
ltdl.c:1017: warning: data definition has no type or storage class
ltdl.c: In function `lt_erealloc':
ltdl.c:1028: error: syntax error before "size_t"
ltdl.c: At top level:
ltdl.c:2162: error: syntax error before "size_t"
ltdl.c:2165: error: syntax error before '*' token
ltdl.c:2165: warning: data definition has no type or storage class
ltdl.c:2188: error: syntax error before "size_t"
ltdl.c:2192: error: syntax error before "size_t"
ltdl.c:2195: error: syntax error before "size_t"
ltdl.c:2202: error: syntax error before "size_t"
ltdl.c: In function `tryall_dlopen_module':
ltdl.c:2477: error: `size_t' undeclared (first use in this function)
ltdl.c:2477: error: syntax error before "filename_len"
ltdl.c:2489: error: `dirname_len' undeclared (first use in this function)
ltdl.c:2492: error: `filename_len' undeclared (first use in this function)
ltdl.c: In function `canonicalize_path':
ltdl.c:2581: error: `size_t' undeclared (first use in this function)
ltdl.c:2581: error: syntax error before "dest"
ltdl.c:2583: error: `src' undeclared (first use in this function)
ltdl.c:2590: error: `dest' undeclared (first use in this function)
ltdl.c: In function `argzize_path':
ltdl.c:2633: error: syntax error before "size_t"
ltdl.c:2645: error: `ENOMEM' undeclared (first use in this function)
ltdl.c: In function `foreach_dirinpath':
ltdl.c:2673: error: `size_t' undeclared (first use in this function)
ltdl.c:2673: error: syntax error before "lenbase"
ltdl.c:2690: error: `argz_len' undeclared (first use in this function)
ltdl.c:2697: error: syntax error before "lendir"
ltdl.c:2699: error: `lendir' undeclared (first use in this function)
ltdl.c:2699: error: `lenbase' undeclared (first use in this function)
ltdl.c: In function `find_file_callback':
ltdl.c:2745: error: `FILE' undeclared (first use in this function)
ltdl.c:2745: error: `pfile' undeclared (first use in this function)
ltdl.c:2745: error: syntax error before ')' token
ltdl.c:2754: warning: initialization discards qualifiers from pointer target type
ltdl.c: At top level:
ltdl.c:2767: error: syntax error before '*' token
ltdl.c: In function `find_file':
ltdl.c:2773: error: `FILE' undeclared (first use in this function)
ltdl.c:2773: error: `file' undeclared (first use in this function)
ltdl.c: In function `trim':
ltdl.c:3011: error: `size_t' undeclared (first use in this function)
ltdl.c:3011: error: syntax error before "len"
ltdl.c:3019: error: `len' undeclared (first use in this function)
ltdl.c: In function `try_dlopen':
ltdl.c:3105: warning: assignment discards qualifiers from pointer target type
ltdl.c:3108: error: `size_t' undeclared (first use in this function)
ltdl.c:3108: error: syntax error before "dirlen"
ltdl.c:3110: error: `dirlen' undeclared (first use in this function)
ltdl.c:3132: error: `FILE' undeclared (first use in this function)
ltdl.c:3132: error: `file' undeclared (first use in this function)
ltdl.c:3138: error: syntax error before "line_len"
ltdl.c:3155: error: syntax error before "i"
ltdl.c:3156: error: `i' undeclared (first use in this function)
ltdl.c:3220: error: `line_len' undeclared (first use in this function)
ltdl.c:3300: warning: assignment discards qualifiers from pointer target type
ltdl.c: In function `lt_dlopenext':
ltdl.c:3467: error: `size_t' undeclared (first use in this function)
ltdl.c:3467: error: syntax error before "len"
ltdl.c:3477: error: `len' undeclared (first use in this function)
ltdl.c:3478: warning: assignment discards qualifiers from pointer target type
ltdl.c: In function `lt_argz_insert':
ltdl.c:3550: error: syntax error before "size_t"
ltdl.c:3567: error: `ENOMEM' undeclared (first use in this function)
ltdl.c: In function `lt_argz_insertinorder':
ltdl.c:3583: error: syntax error before "size_t"
ltdl.c:3593: error: invalid type argument of `unary *'
ltdl.c: In function `lt_argz_insertdir':
ltdl.c:3607: error: syntax error before "size_t"
ltdl.c:3612: error: `size_t' undeclared (first use in this function)
ltdl.c:3612: error: syntax error before "buf_len"
ltdl.c:3614: error: syntax error before "end_offset"
ltdl.c:3622: error: `dir_len' undeclared (first use in this function)
ltdl.c:3623: error: dereferencing pointer to incomplete type
ltdl.c:3623: error: dereferencing pointer to incomplete type
ltdl.c:3628: error: dereferencing pointer to incomplete type
ltdl.c:3639: error: dereferencing pointer to incomplete type
ltdl.c:3648: error: `end_offset' undeclared (first use in this function)
ltdl.c:3648: error: dereferencing pointer to incomplete type
ltdl.c:3649: error: `buf_len' undeclared (first use in this function)
ltdl.c:3658: error: dereferencing pointer to incomplete type
ltdl.c: In function `list_files_by_dir':
ltdl.c:3674: error: syntax error before "size_t"
ltdl.c:3676: error: `DIR' undeclared (first use in this function)
ltdl.c:3676: error: `dirp' undeclared (first use in this function)
ltdl.c:3689: warning: assignment makes pointer from integer without a cast
ltdl.c:3690: error: dereferencing pointer to incomplete type
ltdl.c: In function `foreachfile_callback':
ltdl.c:3719: error: `size_t' undeclared (first use in this function)
ltdl.c:3719: error: syntax error before "argz_len"
ltdl.c:3721: error: `argz_len' undeclared (first use in this function)
ltdl.c: In function `lt_dlsym':
ltdl.c:3864: error: `size_t' undeclared (first use in this function)
ltdl.c:3864: error: syntax error before "lensym"
ltdl.c:3882: error: `lensym' undeclared (first use in this function)
ltdl.c: In function `lt_dlpath_insertdir':
ltdl.c:3973: error: `size_t' undeclared (first use in this function)
ltdl.c:3973: error: syntax error before "argz_len"
ltdl.c:4001: error: `argz_len' undeclared (first use in this function)
gmake[2]: *** [ltdl.lo] Error 1
gmake[2]: Leaving directory `/home/gnuworld/gnuworld/libltdl'
gmake[1]: *** [all] Error 2
gmake[1]: Leaving directory `/home/gnuworld/gnuworld/libltdl'
gmake: *** [all-recursive] Error 1