All pastes #237370 Raw Edit

Miscellany

public text v1 · immutable
·published 2006-11-04 14:42 UTC
rendered paste body
lding for VMware Server 1.0.0.
Using 2.6.x kernel build system.
make: Entering directory `/tmp/vmware-config1/vmmon-only'
make -C /lib/modules/2.6.18-jen35-default/build/include/.. SUBDIRS=$PWD SRCROOT=
$PWD/. modules
make[1]: Entering directory `/usr/src/linux-2.6.18-jen35-obj/i386/default'
make -C ../../../linux-2.6.18-jen35 O=../linux-2.6.18-jen35-obj/i386/default mod
ules
  CC [M]  /tmp/vmware-config1/vmmon-only/linux/driver.o
In file included from /tmp/vmware-config1/vmmon-only/linux/driver.h:20,
                 from /tmp/vmware-config1/vmmon-only/linux/driver.c:53:
/tmp/vmware-config1/vmmon-only/./include/compat_wait.h:37:5: warning: "VMW_HAVE_
EPOLL" is not defined
/tmp/vmware-config1/vmmon-only/./include/compat_wait.h:43:5: warning: "VMW_HAVE_
EPOLL" is not defined
In file included from /tmp/vmware-config1/vmmon-only/linux/driver.h:20,
                 from /tmp/vmware-config1/vmmon-only/linux/driver.c:53:
/tmp/vmware-config1/vmmon-only/./include/compat_wait.h:60: error: conflicting ty
pes for #poll_initwait#
/usr/src/linux-2.6.18-jen35/include/linux/poll.h:62: error: previous declaration
 of #poll_initwait# was here
/tmp/vmware-config1/vmmon-only/linux/driver.c:160: warning: initialization from 
incompatible pointer type
/tmp/vmware-config1/vmmon-only/linux/driver.c:164: warning: initialization from 
incompatible pointer type
make[4]: *** [/tmp/vmware-config1/vmmon-only/linux/driver.o] Error 1
make[3]: *** [_module_/tmp/vmware-config1/vmmon-only] Error 2
make[2]: *** [modules] Error 2
make[1]: *** [modules] Error 2
make[1]: Leaving directory `/usr/src/linux-2.6.18-jen35-obj/i386/default'
make: *** [vmmon.ko] Error 2
make: Leaving directory `/tmp/vmware-config1/vmmon-only'
Unable to build the vmmon module.

For more information on how to troubleshoot module-related problems, please 
visit our Web site at "http://www.vmware.com/download/modules/modules.html" and
"http://www.vmware.com/support/reference/linux/prebuilt_modules_linux.html".

Execution aborted.