All pastes #237198 Raw Edit

Someone

public text v1 · immutable
·published 2006-11-04 12:19 UTC
rendered paste body
aether:/MacPorts root# port install -v Adium
--->  Building adium with target -project Adium.xcodeproj -target Adium
Error: Target com.apple.build returned: shell command "cd "/opt/local/var/db/dports/build/_opt_local_var_db_dports_sources_rsync.rsync.darwinports.org_dpupdate_dports_aqua_adium/work/adium-0.89" && /usr/bin/xcodebuild -project Adium.xcodeproj -target Adium -configuration Deployment" returned error 1
Command output:     setenv MACOSX_DEPLOYMENT_TARGET 10.2
    /usr/bin/gcc-3.3 -x objective-c-header -arch ppc -pipe -Wno-trigraphs -fpascal-strings -fasm-blocks -gfull -Os -fmessage-length=0 -mtune=G4 -Wp,-header-mapfile,/opt/local/var/db/dports/build/_opt_local_var_db_dports_sources_rsync.rsync.darwinports.org_dpupdate_dports_aqua_adium/work/adium-0.89/build/Adium.build/Deployment/WebKit\ Message\ View.build/WebKit\ Message\ View.hmap -F/opt/local/var/db/dports/build/_opt_local_var_db_dports_sources_rsync.rsync.darwinports.org_dpupdate_dports_aqua_adium/work/adium-0.89/build/Deployment -I/opt/local/var/db/dports/build/_opt_local_var_db_dports_sources_rsync.rsync.darwinports.org_dpupdate_dports_aqua_adium/work/adium-0.89/build/Deployment/include -I/opt/local/var/db/dports/build/_opt_local_var_db_dports_sources_rsync.rsync.darwinports.org_dpupdate_dports_aqua_adium/work/adium-0.89/build/Adium.build/Deployment/WebKit\ Message\ View.build/DerivedSources -DMAC_OS_X_VERSION_MIN_REQUIRED=1020 -fconstant-cfstrings -D__CONSTANT_CFSTRINGS__ -DCRASH_REPORTER -c /opt/local/var/db/dports/build/_opt_local_var_db_dports_sources_rsync.rsync.darwinports.org_dpupdate_dports_aqua_adium/work/adium-0.89/Adium.pch -o /Library/Caches/com.apple.Xcode.0/SharedPrecompiledHeaders/Adium-gbywtimudpcafabpyvejbizmofdm/Adium.pch.gch

ProcessPCH /Library/Caches/com.apple.Xcode.0/SharedPrecompiledHeaders/Adium-fuwkvifsrsqazkgjjblivfmepmzz/Adium.pch.gch Adium.pch normal i386 objective-c com.apple.compilers.gcc.4_0
    cd /opt/local/var/db/dports/build/_opt_local_var_db_dports_sources_rsync.rsync.darwinports.org_dpupdate_dports_aqua_adium/work/adium-0.89
    /usr/bin/gcc-4.0 -x objective-c-header -arch i386 -pipe -Wno-trigraphs -fpascal-strings -fasm-blocks -gfull -Os -fmessage-length=0 -mmacosx-version-min=10.4 -I/opt/local/var/db/dports/build/_opt_local_var_db_dports_sources_rsync.rsync.darwinports.org_dpupdate_dports_aqua_adium/work/adium-0.89/build/Adium.build/Deployment/WebKit\ Message\ View.build/WebKit\ Message\ View.hmap -F/opt/local/var/db/dports/build/_opt_local_var_db_dports_sources_rsync.rsync.darwinports.org_dpupdate_dports_aqua_adium/work/adium-0.89/build/Deployment -I/opt/local/var/db/dports/build/_opt_local_var_db_dports_sources_rsync.rsync.darwinports.org_dpupdate_dports_aqua_adium/work/adium-0.89/build/Deployment/include -I/opt/local/var/db/dports/build/_opt_local_var_db_dports_sources_rsync.rsync.darwinports.org_dpupdate_dports_aqua_adium/work/adium-0.89/build/Adium.build/Deployment/WebKit\ Message\ View.build/DerivedSources -DCRASH_REPORTER -isysroot /Developer/SDKs/MacOSX10.4u.sdk -c /opt/local/var/db/dports/build/_opt_local_var_db_dports_sources_rsync.rsync.darwinports.org_dpupdate_dports_aqua_adium/work/adium-0.89/Adium.pch -o /Library/Caches/com.apple.Xcode.0/SharedPrecompiledHeaders/Adium-fuwkvifsrsqazkgjjblivfmepmzz/Adium.pch.gch -fsave-repository=/Library/Caches/com.apple.Xcode.0/SharedPrecompiledHeaders/Adium-fuwkvifsrsqazkgjjblivfmepmzz/Adium.pch.gch.o

CompileC "build/Adium.build/Deployment/WebKit Message View.build/Objects-normal/ppc/AIWebKitMessageViewController.o" "/opt/local/var/db/dports/build/_opt_local_var_db_dports_sources_rsync.rsync.darwinports.org_dpupdate_dports_aqua_adium/work/adium-0.89/Plugins/WebKit Message View/AIWebKitMessageViewController.m" normal ppc objective-c com.apple.compilers.gcc.3_3
    cd /opt/local/var/db/dports/build/_opt_local_var_db_dports_sources_rsync.rsync.darwinports.org_dpupdate_dports_aqua_adium/work/adium-0.89
    setenv MACOSX_DEPLOYMENT_TARGET 10.2
    /usr/bin/gcc-3.3 -x objective-c -arch ppc -pipe -Wno-trigraphs -fpascal-strings -fasm-blocks -gfull -Os -fmessage-length=0 -mtune=G4 -Wp,-header-mapfile,/opt/local/var/db/dports/build/_opt_local_var_db_dports_sources_rsync.rsync.darwinports.org_dpupdate_dports_aqua_adium/work/adium-0.89/build/Adium.build/Deployment/WebKit\ Message\ View.build/WebKit\ Message\ View.hmap -F/opt/local/var/db/dports/build/_opt_local_var_db_dports_sources_rsync.rsync.darwinports.org_dpupdate_dports_aqua_adium/work/adium-0.89/build/Deployment -I/opt/local/var/db/dports/build/_opt_local_var_db_dports_sources_rsync.rsync.darwinports.org_dpupdate_dports_aqua_adium/work/adium-0.89/build/Deployment/include -I/opt/local/var/db/dports/build/_opt_local_var_db_dports_sources_rsync.rsync.darwinports.org_dpupdate_dports_aqua_adium/work/adium-0.89/build/Adium.build/Deployment/WebKit\ Message\ View.build/DerivedSources -DMAC_OS_X_VERSION_MIN_REQUIRED=1020 -fconstant-cfstrings -D__CONSTANT_CFSTRINGS__ -DCRASH_REPORTER -include /Library/Caches/com.apple.Xcode.0/SharedPrecompiledHeaders/Adium-gbywtimudpcafabpyvejbizmofdm/Adium.pch -c /opt/local/var/db/dports/build/_opt_local_var_db_dports_sources_rsync.rsync.darwinports.org_dpupdate_dports_aqua_adium/work/adium-0.89/Plugins/WebKit\ Message\ View/AIWebKitMessageViewController.m -o /opt/local/var/db/dports/build/_opt_local_var_db_dports_sources_rsync.rsync.darwinports.org_dpupdate_dports_aqua_adium/work/adium-0.89/build/Adium.build/Deployment/WebKit\ Message\ View.build/Objects-normal/ppc/AIWebKitMessageViewController.o
In file included from /opt/local/var/db/dports/build/_opt_local_var_db_dports_sources_rsync.rsync.darwinports.org_dpupdate_dports_aqua_adium/work/adium-0.89/Plugins/WebKit Message View/AIWebKitMessageViewController.m:22:
/opt/local/var/db/dports/build/_opt_local_var_db_dports_sources_rsync.rsync.darwinports.org_dpupdate_dports_aqua_adium/work/adium-0.89/Plugins/WebKit Message View/AIWebKitMessageViewPlugin.h:18:26: WebKit/WebKit.h: No such file or directory
In file included from /opt/local/var/db/dports/build/_opt_local_var_db_dports_sources_rsync.rsync.darwinports.org_dpupdate_dports_aqua_adium/work/adium-0.89/Plugins/WebKit Message View/ESWebFrameViewAdditions.h:17,
                 from /opt/local/var/db/dports/build/_opt_local_var_db_dports_sources_rsync.rsync.darwinports.org_dpupdate_dports_aqua_adium/work/adium-0.89/Plugins/WebKit Message View/AIWebKitMessageViewController.m:24:
/opt/local/var/db/dports/build/_opt_local_var_db_dports_sources_rsync.rsync.darwinports.org_dpupdate_dports_aqua_adium/work/adium-0.89/Plugins/WebKit Message View/WebKitPrivateDefinitions.h:9:26: WebKit/WebKit.h: No such file or directory
In file included from /opt/local/var/db/dports/build/_opt_local_var_db_dports_sources_rsync.rsync.darwinports.org_dpupdate_dports_aqua_adium/work/adium-0.89/Plugins/WebKit Message View/ESWebFrameViewAdditions.h:17,
                 from /opt/local/var/db/dports/build/_opt_local_var_db_dports_sources_rsync.rsync.darwinports.org_dpupdate_dports_aqua_adium/work/adium-0.89/Plugins/WebKit Message View/AIWebKitMessageViewController.m:24:
/opt/local/var/db/dports/build/_opt_local_var_db_dports_sources_rsync.rsync.darwinports.org_dpupdate_dports_aqua_adium/work/adium-0.89/Plugins/WebKit Message View/WebKitPrivateDefinitions.h:61: error: parse error before "WebView"
/opt/local/var/db/dports/build/_opt_local_var_db_dports_sources_rsync.rsync.darwinports.org_dpupdate_dports_aqua_adium/work/adium-0.89/Plugins/WebKit Message View/WebKitPrivateDefinitions.h:75: error: cannot find protocol declaration for `WebDocumentView'
In file included from /opt/local/var/db/dports/build/_opt_local_var_db_dports_sources_rsync.rsync.darwinports.org_dpupdate_dports_aqua_adium/work/adium-0.89/Plugins/WebKit Message View/AIWebKitMessageViewController.m:24:
/opt/local/var/db/dports/build/_opt_local_var_db_dports_sources_rsync.rsync.darwinports.org_dpupdate_dports_aqua_adium/work/adium-0.89/Plugins/WebKit Message View/ESWebFrameViewAdditions.h:20: error: cannot find interface declaration for `WebFrameView'

CompileC "build/Adium.build/Deployment/WebKit Message View.build/Objects-normal/ppc/AIWebKitMessageViewPlugin.o" "/opt/local/var/db/dports/build/_opt_local_var_db_dports_sources_rsync.rsync.darwinports.org_dpupdate_dports_aqua_adium/work/adium-0.89/Plugins/WebKit Message View/AIWebKitMessageViewPlugin.m" normal ppc objective-c com.apple.compilers.gcc.3_3
    cd /opt/local/var/db/dports/build/_opt_local_var_db_dports_sources_rsync.rsync.darwinports.org_dpupdate_dports_aqua_adium/work/adium-0.89
    setenv MACOSX_DEPLOYMENT_TARGET 10.2
    /usr/bin/gcc-3.3 -x objective-c -arch ppc -pipe -Wno-trigraphs -fpascal-strings -fasm-blocks -gfull -Os -fmessage-length=0 -mtune=G4 -Wp,-header-mapfile,/opt/local/var/db/dports/build/_opt_local_var_db_dports_sources_rsync.rsync.darwinports.org_dpupdate_dports_aqua_adium/work/adium-0.89/build/Adium.build/Deployment/WebKit\ Message\ View.build/WebKit\ Message\ View.hmap -F/opt/local/var/db/dports/build/_opt_local_var_db_dports_sources_rsync.rsync.darwinports.org_dpupdate_dports_aqua_adium/work/adium-0.89/build/Deployment -I/opt/local/var/db/dports/build/_opt_local_var_db_dports_sources_rsync.rsync.darwinports.org_dpupdate_dports_aqua_adium/work/adium-0.89/build/Deployment/include -I/opt/local/var/db/dports/build/_opt_local_var_db_dports_sources_rsync.rsync.darwinports.org_dpupdate_dports_aqua_adium/work/adium-0.89/build/Adium.build/Deployment/WebKit\ Message\ View.build/DerivedSources -DMAC_OS_X_VERSION_MIN_REQUIRED=1020 -fconstant-cfstrings -D__CONSTANT_CFSTRINGS__ -DCRASH_REPORTER -include /Library/Caches/com.apple.Xcode.0/SharedPrecompiledHeaders/Adium-gbywtimudpcafabpyvejbizmofdm/Adium.pch -c /opt/local/var/db/dports/build/_opt_local_var_db_dports_sources_rsync.rsync.darwinports.org_dpupdate_dports_aqua_adium/work/adium-0.89/Plugins/WebKit\ Message\ View/AIWebKitMessageViewPlugin.m -o /opt/local/var/db/dports/build/_opt_local_var_db_dports_sources_rsync.rsync.darwinports.org_dpupdate_dports_aqua_adium/work/adium-0.89/build/Adium.build/Deployment/WebKit\ Message\ View.build/Objects-normal/ppc/AIWebKitMessageViewPlugin.o
In file included from /opt/local/var/db/dports/build/_opt_local_var_db_dports_sources_rsync.rsync.darwinports.org_dpupdate_dports_aqua_adium/work/adium-0.89/Plugins/WebKit Message View/AIWebKitMessageViewPlugin.m:20:
/opt/local/var/db/dports/build/_opt_local_var_db_dports_sources_rsync.rsync.darwinports.org_dpupdate_dports_aqua_adium/work/adium-0.89/Plugins/WebKit Message View/AIWebKitMessageViewPlugin.h:18:26: WebKit/WebKit.h: No such file or directory
** BUILD FAILED **

Error: Status 1 encountered during processing.