make[2]: Entering directory `/home/bilbo/OE/build/tmp/work/handhelds-sa-2.6-2.6.12-hh0+cvs20050923-r0/kernel26'| CC arch/arm/mach-sa1100/usb/sa1100usb.o
| CC arch/arm/mm/proc-syms.o
| CC arch/arm/kernel/sys_arm.o
| CC arch/arm/nwfpe/fpa11_cprt.o
| CC arch/arm/mm/alignment.o
| CC arch/arm/nwfpe/fpmodule.o
| CC arch/arm/kernel/time.o
| CC arch/arm/nwfpe/fpopcode.o
| CC arch/arm/mach-sa1100/usb/usb_recv.o
| CC arch/arm/mm/discontig.o
| CC arch/arm/kernel/traps.o
| CC arch/arm/nwfpe/softfloat.o
| AS arch/arm/mm/abort-ev4.o
| arch/arm/nwfpe/softfloat.c:70: warning: "struct roundingData" declared inside parameter list
| arch/arm/nwfpe/softfloat.c:70: warning: its scope is only this definition or declaration, which is probably not what you want
| arch/arm/nwfpe/softfloat.c: In function `roundAndPackInt32':
| arch/arm/nwfpe/softfloat.c:77: error: dereferencing pointer to incomplete type
| arch/arm/nwfpe/softfloat.c:100: error: dereferencing pointer to incomplete type
| arch/arm/nwfpe/softfloat.c:103: error: dereferencing pointer to incomplete type
| arch/arm/nwfpe/softfloat.c: At top level:
| arch/arm/nwfpe/softfloat.c:217: warning: "struct roundingData" declared inside parameter list
| arch/arm/nwfpe/softfloat.c: In function `roundAndPackFloat32':
| arch/arm/nwfpe/softfloat.c:224: error: dereferencing pointer to incomplete type
| arch/arm/nwfpe/softfloat.c:247: error: dereferencing pointer to incomplete type
| arch/arm/nwfpe/softfloat.c:258: error: dereferencing pointer to incomplete type
| arch/arm/nwfpe/softfloat.c:261: error: dereferencing pointer to incomplete type
| arch/arm/nwfpe/softfloat.c: At top level:
| arch/arm/nwfpe/softfloat.c:280: warning: "struct roundingData" declared inside parameter list
| arch/arm/nwfpe/softfloat.c:388: warning: "struct roundingData" declared inside parameter list
| arch/arm/nwfpe/softfloat.c: In function `roundAndPackFloat64':
| arch/arm/nwfpe/softfloat.c:395: error: dereferencing pointer to incomplete type
| arch/arm/nwfpe/softfloat.c:420: error: dereferencing pointer to incomplete type
| arch/arm/nwfpe/softfloat.c:431: error: dereferencing pointer to incomplete type
| arch/arm/nwfpe/softfloat.c:434: error: dereferencing pointer to incomplete type
[..]
make[1]: *** [arch/arm/nwfpe/softfloat.o] Błąd 1
| make[1]: Leaving directory `/home/bilbo/OE/build/tmp/work/handhelds-sa-2.6-2.6.12-hh0+cvs20050923-r0/kernel26'
| make: *** [arch/arm/nwfpe] Błąd 2