All pastes #236513 Raw Edit

leon

public text v1 · immutable
·published 2006-11-03 21:07 UTC
rendered paste body
build06 started "build wxMaxima.spec" at Wed Nov 1 18:15:27 CET 2006.Building 'wxMaxima' for project 'home:kommerck' target 'SUSE_Linux_10.1' arch 'i586' srcmd5 'a05d03d49df65910128114e84dd9a680'Using BUILD_ROOT=/BUILD/root_1Using BUILD_ARCH=i586:i486:i386processing specfile /BUILD/root_1/.build-srcdir/wxMaxima.spec...init_buildsystem --rpmlist /BUILD/root_1/.rpmlist wxMaxima.spec ...preinstalling aaa_base...preinstalling acl...preinstalling attr...preinstalling bash...preinstalling bzip2...preinstalling coreutils...preinstalling db...preinstalling diffutils...preinstalling filesystem...preinstalling fillup...preinstalling glibc...preinstalling grep...preinstalling insserv...preinstalling libacl...preinstalling libattr...preinstalling libgcc...preinstalling libnscd...preinstalling libxcrypt...preinstalling m4...preinstalling ncurses...preinstalling pam...preinstalling permissions...preinstalling popt...preinstalling pwdutils...preinstalling readline...preinstalling rpm...preinstalling sed...preinstalling tar...preinstalling zlib...running aaa_base preinstall scriptrunning aaa_base postinstall scriptUpdating etc/sysconfig/language...Updating etc/sysconfig/backup...Updating etc/sysconfig/boot...Updating etc/sysconfig/displaymanager...Updating etc/sysconfig/kernel...Updating etc/sysconfig/suseconfig...Updating etc/sysconfig/clock...Updating etc/sysconfig/proxy...Updating etc/sysconfig/windowmanager...Updating etc/sysconfig/sysctl...Updating etc/sysconfig/mail...Updating etc/sysconfig/cron...Updating etc/sysconfig/news...Updating etc/sysconfig/shutdown...Updating etc/passwd...unchangedUpdating etc/group...unchangedUpdating etc/shadow...newrunning coreutils postinstall scriptrunning diffutils postinstall scriptrunning fillup postinstall scriptrunning grep postinstall scriptrunning m4 postinstall scriptrunning permissions postinstall scriptUpdating etc/sysconfig/security...running pwdutils preinstall scriptrunning pwdutils postinstall scriptrunning rpm postinstall scriptUpdating etc/sysconfig/services...running sed postinstall scriptrunning tar postinstall scriptinitializing rpm db...reordering...doneinstalling filesystem-10.1-5installing glibc-2.4-25warning: /etc/bindresvport.blacklist created as /etc/bindresvport.blacklist.rpmnewwarning: /etc/default/nss created as /etc/default/nss.rpmnewwarning: /etc/nsswitch.conf created as /etc/nsswitch.conf.rpmnewwarning: /etc/rpc created as /etc/rpc.rpmnewinstalling zlib-1.2.3-13installing ncurses-5.5-16installing freetype2-2.1.10-16installing expat-2.0.0-11installing libgcc-4.1.0-25installing libstdc++-4.1.0-25installing fontconfig-2.3.94-17installing xorg-x11-libs-6.9.0-48installing libpng-1.2.8-17installing libjpeg-6.2.0-750installing libtiff-3.8.2-3installing libattr-2.4.28-14installing libacl-2.2.34-12installing db-4.3.29-13installing gdbm-1.8.3-241installing mktemp-1.5-742installing readline-5.1-22installing bash-3.1-22installing insserv-1.04.0-18installing bzip2-1.0.3-15installing libzio-0.1-15installing info-4.8-20installing fillup-1.42-116installing sed-4.1.4-15installing m4-1.4.4-10installing grep-2.5.1a-18installing cracklib-2.8.6-12installing pam-0.99.3.0-25warning: /etc/environment created as /etc/environment.rpmnewwarning: /etc/pam.d/common-account created as /etc/pam.d/common-account.rpmnewwarning: /etc/pam.d/common-auth created as /etc/pam.d/common-auth.rpmnewwarning: /etc/pam.d/common-password created as /etc/pam.d/common-password.rpmnewwarning: /etc/pam.d/common-session created as /etc/pam.d/common-session.rpmnewwarning: /etc/pam.d/other created as /etc/pam.d/other.rpmnewwarning: /etc/securetty created as /etc/securetty.rpmnewwarning: /etc/security/access.conf created as /etc/security/access.conf.rpmnewwarning: /etc/security/group.conf created as /etc/security/group.conf.rpmnewwarning: /etc/security/limits.conf created as /etc/security/limits.conf.rpmnewwarning: /etc/security/pam_env.conf created as /etc/security/pam_env.conf.rpmnewwarning: /etc/security/time.conf created as /etc/security/time.conf.rpmnewinstalling coreutils-5.93-20warning: /etc/default/su created as /etc/default/su.rpmnewinstalling gnome-filesystem-0.1-259installing glib2-2.8.5-19installing atk-1.10.3-15installing resmgr-0.9.8_SVNr75-18installing freetype2-devel-2.1.10-16installing libmspack-0.0.20040308alpha-16installing zlib-devel-1.2.3-13installing libxcrypt-2.4-10installing pam-modules-10.1-7installing libpng-devel-1.2.8-17installing alsa-1.0.11-32Updating etc/sysconfig/sound...Updating etc/sysconfig/joystick...installing cyrus-sasl-2.1.21-18installing gpm-1.20.1-320Updating etc/sysconfig/mouse...installing libxml2-2.6.23-13installing slang-2.0.5-12installing aalib-1.4.0-305installing SDL-1.2.9-19installing binutils-2.16.91.0.5-18installing cpio-2.6-17installing diffutils-2.8.7-15installing findutils-4.2.27-12installing gawk-3.1.5-18installing gettext-0.14.5-11installing gzip-1.3.5-157installing perl-5.8.8-12Updating etc/sysconfig/suseconfig...installing glibc-devel-2.4-25installing openssl-0.9.8a-16installing fontconfig-devel-2.3.94-17installing xorg-x11-devel-6.9.0-48installing aaa_base-10.1-41warning: /etc/DIR_COLORS created as /etc/DIR_COLORS.rpmnewwarning: /etc/inittab created as /etc/inittab.rpmnewwarning: /root/.exrc created as /root/.exrc.rpmnewUpdating etc/sysconfig/language...Updating etc/sysconfig/backup...Updating etc/sysconfig/boot...Updating etc/sysconfig/displaymanager...Updating etc/sysconfig/kernel...Updating etc/sysconfig/suseconfig...Updating etc/sysconfig/clock...Updating etc/sysconfig/proxy...Updating etc/sysconfig/windowmanager...Updating etc/sysconfig/sysctl...Updating etc/sysconfig/mail...Updating etc/sysconfig/cron...Updating etc/sysconfig/news...Updating etc/sysconfig/shutdown...Updating etc/passwd...unchangedUpdating etc/group...unchangedUpdating etc/shadow...unchangedinstalling permissions-2006.2.24-8Updating etc/sysconfig/security...installing bind-libs-9.3.2-17installing openldap2-client-2.3.19-18installing groff-1.18.1.1-29Updating etc/sysconfig/suseconfig...installing cpp-4.1.0-25installing gcc-4.1.0-25installing libstdc++-devel-4.1.0-25installing libcom_err-1.38-25installing tcpd-7.6-729installing openmotif-libs-2.2.4-21installing file-4.16-13installing less-394-12installing audiofile-0.2.6-15installing esound-0.2.36-19Updating etc/sysconfig/esound...installing libdrm-2.0-13installing Mesa-6.4.2-19installing glitz-0.4.4-21installing cairo-1.0.2-25installing pango-1.10.2-21installing gtk2-2.8.10-36installing wxGTK-2.6.2.1-20installing Mesa-devel-6.4.2-19installing libnscd-1.1-14installing pkgconfig-0.20-12installing glib2-devel-2.8.5-19installing atk-devel-1.10.3-15installing glitz-devel-0.4.4-21installing cairo-devel-1.0.2-25installing pango-devel-1.10.2-21installing gtk2-devel-2.8.10-36installing popt-1.7-268installing unixODBC-2.2.11-19installing wxGTK-compat-2.6.2.1-20installing wxGTK-gl-2.6.2.1-20installing acl-2.2.34-12installing attr-2.4.28-14installing autoconf-2.59-90installing automake-1.9.6-11installing bind-utils-9.3.2-17installing bison-2.1-11installing cvs-1.12.12-19installing e2fsprogs-1.38-25installing flex-2.5.31-16installing gcc-c++-4.1.0-25installing gdbm-devel-1.8.3-241installing gettext-devel-0.14.5-11installing glibc-locale-2.4-25installing klogd-1.4.1-557installing libtool-1.5.22-11installing libxml2-devel-2.6.23-13installing make-3.80-200installing man-2.4.1-235Updating etc/sysconfig/cron...installing module-init-tools-3.2.2-32installing ncurses-devel-5.5-16installing net-tools-1.60-581installing netcfg-10.1-5warning: /etc/HOSTNAME created as /etc/HOSTNAME.rpmnewinstalling patch-2.5.9-158installing procinfo-18-53installing procps-3.2.6-16installing psmisc-22.1-12installing pwdutils-3.0.7.1-17warning: /etc/default/passwd created as /etc/default/passwd.rpmnewwarning: /etc/default/useradd created as /etc/default/useradd.rpmnewwarning: /etc/ldap.conf created as /etc/ldap.conf.rpmnewwarning: /etc/pwdutils/logging created as /etc/pwdutils/logging.rpmnewwarning: /etc/rpasswd.conf created as /etc/rpasswd.conf.rpmnewwarning: /usr/sbin/groupadd.local created as /usr/sbin/groupadd.local.rpmnewwarning: /usr/sbin/useradd.local created as /usr/sbin/useradd.local.rpmnewwarning: /usr/sbin/userdel-post.local created as /usr/sbin/userdel-post.local.rpmnewwarning: /usr/sbin/userdel-pre.local created as /usr/sbin/userdel-pre.local.rpmnewinstalling rcs-5.7-879installing rpm-4.4.2-40Updating etc/sysconfig/services...installing strace-4.5.14-15installing sysvinit-2.86-19installing tar-1.15.1-21installing texinfo-4.8-20installing timezone-2.4-25installing unzip-5.52-14installing util-linux-2.12r-35installing vim-6.4.6-19installing wxGTK-devel-2.6.2.1-20removing nis flags from /BUILD/root_1/etc/nsswitch.conf...now finalizing build dir...Checking permissions and ownerships - using the permissions files	/tmp/Check.perms.W11435setting /usr/src/packages/SOURCES/ to root:root 1777. (wrong permissions 0755)setting /usr/src/packages/BUILD/ to root:root 1777. (wrong permissions 0755)setting /usr/src/packages/RPMS/ to root:root 1777. (wrong permissions 0755)setting /usr/src/packages/RPMS/athlon/ to root:root 1777. (wrong permissions 0755)setting /usr/src/packages/RPMS/i386/ to root:root 1777. (wrong permissions 0755)setting /usr/src/packages/RPMS/i486/ to root:root 1777. (wrong permissions 0755)setting /usr/src/packages/RPMS/i586/ to root:root 1777. (wrong permissions 0755)setting /usr/src/packages/RPMS/i686/ to root:root 1777. (wrong permissions 0755)setting /usr/src/packages/RPMS/noarch/ to root:root 1777. (wrong permissions 0755)setting /usr/src/packages/SPECS/ to root:root 1777. (wrong permissions 0755)setting /usr/src/packages/SRPMS/ to root:root 1777. (wrong permissions 0755)setting /usr/bin/wall to root:tty 2755. (wrong permissions 0755)setting /usr/bin/write to root:tty 2755. (wrong permissions 0755)Starting SuSEconfig, the SuSE Configuration Tool...Running in full featured mode.Reading /etc/sysconfig and updating the system...Executing /sbin/conf.d/SuSEconfig.automake...Executing /sbin/conf.d/SuSEconfig.groff...Executing /sbin/conf.d/SuSEconfig.gtk2...Executing /sbin/conf.d/SuSEconfig.libxml2...Executing /sbin/conf.d/SuSEconfig.news...Installing new /etc/nntpserverExecuting /sbin/conf.d/SuSEconfig.pango...Executing /sbin/conf.d/SuSEconfig.perl...Executing /sbin/conf.d/SuSEconfig.permissions...Executing /sbin/conf.d/SuSEconfig.sortpasswd...Executing /sbin/conf.d/SuSEconfig.zmessages...Executing /sbin/conf.d/SuSEconfig.zzzgnome-filesystem...Finished.-----------------------------------------------------------------I have the following modifications for wxMaxima.spec:5c5< Release: 1---> Release: 2.1---------------------------------------------------------------------- building wxMaxima.spec (user abuild)----------------------------------------------------------------------------------------------------------------------------------Executing(%prep): /bin/sh -e /var/tmp/rpm-tmp.13696+ umask 022+ cd /usr/src/packages/BUILD+ cd /usr/src/packages/BUILD+ rm -rf wxMaxima-0.7.0a+ /usr/bin/gzip -dc /usr/src/packages/SOURCES/wxMaxima-0.7.0a.tar.gz+ tar -xf -+ STATUS=0+ '[' 0 -ne 0 ']'+ cd wxMaxima-0.7.0a++ /usr/bin/id -u+ '[' 99 = 0 ']'++ /usr/bin/id -u+ '[' 99 = 0 ']'+ /bin/chmod -Rf a+rX,u+w,g-w,o-w .+ echo 'Patch #0 (wxMaxima-configure-unicode.diff):'Patch #0 (wxMaxima-configure-unicode.diff):+ patch -p0 -s+ exit 0Executing(%build): /bin/sh -e /var/tmp/rpm-tmp.13696+ umask 022+ cd /usr/src/packages/BUILD+ /bin/rm -rf /var/tmp/wxMaxima-0.7.0a-2.1-buildroot++ dirname /var/tmp/wxMaxima-0.7.0a-2.1-buildroot+ /bin/mkdir -p /var/tmp+ /bin/mkdir /var/tmp/wxMaxima-0.7.0a-2.1-buildroot+ cd wxMaxima-0.7.0a+ CFLAGS='-march=i586 -mtune=i686 -fmessage-length=0 -D_FORTIFY_SOURCE=2 -O2'+ export CFLAGS+ CXXFLAGS='-march=i586 -mtune=i686 -fmessage-length=0 -D_FORTIFY_SOURCE=2 -O2'+ export CXXFLAGS+ FFLAGS='-march=i586 -mtune=i686 -fmessage-length=0 -D_FORTIFY_SOURCE=2 -O2'+ export FFLAGS+ ./configure --host=i686-suse-linux --build=i686-suse-linux --target=i586-suse-linux --program-prefix= --prefix=/usr --exec-prefix=/usr --bindir=/usr/bin --sbindir=/usr/sbin --sysconfdir=/etc --datadir=/usr/share --includedir=/usr/include --libdir=/usr/lib --libexecdir=/usr/lib --localstatedir=/var --sharedstatedir=/usr/com --mandir=/usr/share/man --infodir=/usr/share/infochecking build system type... i686-suse-linux-gnuchecking host system type... i686-suse-linux-gnuchecking target system type... i586-suse-linux-gnuchecking for i686-suse-linux-g++... nochecking for i686-suse-linux-c++... nochecking for i686-suse-linux-gpp... nochecking for i686-suse-linux-aCC... nochecking for i686-suse-linux-CC... nochecking for i686-suse-linux-cxx... nochecking for i686-suse-linux-cc++... nochecking for i686-suse-linux-cl... nochecking for i686-suse-linux-FCC... nochecking for i686-suse-linux-KCC... nochecking for i686-suse-linux-RCC... nochecking for i686-suse-linux-xlC_r... nochecking for i686-suse-linux-xlC... nochecking for g++... g++checking for C++ compiler default output file name... a.outchecking whether the C++ compiler works... yeschecking whether we are cross compiling... nochecking for suffix of executables... checking for suffix of object files... ochecking whether we are using the GNU C++ compiler... yeschecking whether g++ accepts -g... yeschecking for i686-suse-linux-gcc... nochecking for gcc... gccchecking whether we are using the GNU C compiler... yeschecking whether gcc accepts -g... yeschecking for gcc option to accept ANSI C... none neededchecking for a BSD-compatible install... /usr/bin/install -cchecking whether make sets $(MAKE)... yeschecking whether build environment is sane... yeschecking for working aclocal-1.4... missingchecking for working autoconf... foundchecking for working automake-1.4... missingchecking for working autoheader... foundchecking for working makeinfo... foundchecking for wx-config... /usr/bin/wx-configchecking for wxWidgets version >= 2.6.0... yes (version 2.6.2)checking for wxWidgets static library... nochecking if we can compile a wxWidgets program... yeschecking for xml2-config... /usr/bin/xml2-configchecking for libxml - version >= 2.5.0... yes (version 2.6.23)configure: creating ./config.statusconfig.status: creating Makefileconfig.status: creating src/Makefileconfig.status: creating locales/Makefileconfig.status: creating data/Makefileconfig.status: creating wxmaxima.specconfig.status: creating data/Info.plistconfig.status: creating src/Setup.hconfig.status: executing default-1 commands+ make DESTDIR=/var/tmp/wxMaxima-0.7.0a-2.1-buildrootMaking all in srcmake[1]: Entering directory `/usr/src/packages/BUILD/wxMaxima-0.7.0a/src'g++ -DHAVE_CONFIG_H -I. -I. -I.   -I/usr/lib/wx/include/gtk2-unicode-release-2.6 -I/usr/include/wx-2.6 -DGTK_NO_CHECK_CASTS -D__WXGTK__ -D_FILE_OFFSET_BITS=64 -D_LARGE_FILES -DNO_GCC_PRAGMA   -I/usr/include/libxml2 -DPREFIX=\"/usr\" -march=i586 -mtune=i686 -fmessage-length=0 -D_FORTIFY_SOURCE=2 -O2 -c CommandLine.cppg++ -DHAVE_CONFIG_H -I. -I. -I.   -I/usr/lib/wx/include/gtk2-unicode-release-2.6 -I/usr/include/wx-2.6 -DGTK_NO_CHECK_CASTS -D__WXGTK__ -D_FILE_OFFSET_BITS=64 -D_LARGE_FILES -DNO_GCC_PRAGMA   -I/usr/include/libxml2 -DPREFIX=\"/usr\" -march=i586 -mtune=i686 -fmessage-length=0 -D_FORTIFY_SOURCE=2 -O2 -c Config.cppg++ -DHAVE_CONFIG_H -I. -I. -I.   -I/usr/lib/wx/include/gtk2-unicode-release-2.6 -I/usr/include/wx-2.6 -DGTK_NO_CHECK_CASTS -D__WXGTK__ -D_FILE_OFFSET_BITS=64 -D_LARGE_FILES -DNO_GCC_PRAGMA   -I/usr/include/libxml2 -DPREFIX=\"/usr\" -march=i586 -mtune=i686 -fmessage-length=0 -D_FORTIFY_SOURCE=2 -O2 -c DragNDrop.cpp/usr/include/libxml2/libxml/xmlerror.h:837: error: typedef 'xmlGenericErrorFunc' is initialized (use __typeof__ instead)/usr/include/libxml2/libxml/xmlerror.h:868: error: function 'void xmlParserError(void*, const char*, ...)' is initialized like a variable/usr/include/libxml2/libxml/xmlerror.h:872: error: function 'void xmlParserWarning(void*, const char*, ...)' is initialized like a variable/usr/include/libxml2/libxml/xmlerror.h:876: error: function 'void xmlParserValidityError(void*, const char*, ...)' is initialized like a variable/usr/include/libxml2/libxml/xmlerror.h:880: error: function 'void xmlParserValidityWarning(void*, const char*, ...)' is initialized like a variable/usr/include/libxml2/libxml/valid.h:44: error: typedef 'xmlValidityErrorFunc' is initialized (use __typeof__ instead)/usr/include/libxml2/libxml/valid.h:59: error: typedef 'xmlValidityWarningFunc' is initialized (use __typeof__ instead)/usr/include/libxml2/libxml/parser.h:595: error: typedef 'warningSAXFunc' is initialized (use __typeof__ instead)/usr/include/libxml2/libxml/parser.h:605: error: typedef 'errorSAXFunc' is initialized (use __typeof__ instead)/usr/include/libxml2/libxml/parser.h:617: error: typedef 'fatalErrorSAXFunc' is initialized (use __typeof__ instead)make[1]: *** [DragNDrop.o] Error 1make[1]: Leaving directory `/usr/src/packages/BUILD/wxMaxima-0.7.0a/src'make: *** [all-recursive] Error 1error: Bad exit status from /var/tmp/rpm-tmp.13696 (%build)RPM build errors:    Bad exit status from /var/tmp/rpm-tmp.13696 (%build)