All pastes #236057 Raw Edit

Quelque chose

public text v1 · immutable
·published 2006-11-03 16:22 UTC
rendered paste body
emerge --info :

Portage 2.1.1-r1 (default-linux/x86/2006.0, gcc-4.1.1, glibc-2.4-r3, 2.6.17-gentoo-r8 i686)
=================================================================
System uname: 2.6.17-gentoo-r8 i686 Intel(R) Pentium(R) 4 CPU 2.80GHz
Gentoo Base System version 1.12.6
Last Sync: Fri, 03 Nov 2006 01:50:01 +0000
distcc 2.18.3 i686-pc-linux-gnu (protocols 1 and 2) (default port 3632) [disabled]
ccache version 2.3 [disabled]
app-admin/eselect-compiler: [Not Present]
dev-java/java-config: 1.3.7, 2.0.30
dev-lang/python:     2.3.5, 2.4.3-r4
dev-python/pycrypto: 2.0.1-r5
dev-util/ccache:     2.3
dev-util/confcache:  [Not Present]
sys-apps/sandbox:    1.2.17
sys-devel/autoconf:  2.13, 2.60
sys-devel/automake:  1.4_p6, 1.5, 1.6.3, 1.7.9-r1, 1.8.5-r3, 1.9.6-r2
sys-devel/binutils:  2.16.1-r3
sys-devel/gcc-config: 1.3.13-r4
sys-devel/libtool:   1.5.22
virtual/os-headers:  2.6.17-r1
ACCEPT_KEYWORDS="x86"
AUTOCLEAN="yes"
CBUILD="i686-pc-linux-gnu"
CFLAGS="-march=pentium4 -O2 -pipe -fomit-frame-pointer -mfpmath=sse -funroll-loops -finline-functions"
CHOST="i686-pc-linux-gnu"
CONFIG_PROTECT="/etc /usr/kde/3.2/share/config /usr/kde/3.3/env /usr/kde/3.3/share/config /usr/kde/3.3/shutdown /usr/kde/3.5/env /usr/kde/3.5/share/config /usr/kde/3.5/shutdown /usr/share/X11/xkb /usr/share/config"
CONFIG_PROTECT_MASK="/etc/env.d /etc/env.d/java/ /etc/gconf /etc/java-config/vms/ /etc/revdep-rebuild /etc/terminfo"
CXXFLAGS="-march=pentium4 -O2 -pipe -fomit-frame-pointer -mfpmath=sse -funroll-loops -finline-functions"
DISTDIR="/usr/portage/distfiles"
FEATURES="autoconfig candy distlocks metadata-transfer sandbox sfperms strict"
GENTOO_MIRRORS="http://gentoo.mirror.sdv.fr/ http://gentoo.mirror.solnet.ch"
LANG="fr_FR@euro"
LC_ALL="fr_FR@euro"
LDFLAGS="-Wl,-O1 -Wl,--enable-new-dtags -Wl,--sort-common -s"
LINGUAS="fr"
MAKEOPTS="-j4"
PKGDIR="/usr/portage/packages"
PORTAGE_RSYNC_OPTS="--recursive --links --safe-links --perms --times --compress --force --whole-file --delete --delete-after --stats --timeout=180 --exclude='/distfiles' --exclude='/local' --exclude='/packages'"
PORTAGE_TMPDIR="/mnt/Z/portage"
PORTDIR="/usr/portage"
PORTDIR_OVERLAY="/usr/local/portage"
SYNC="rsync://rsync.europe.gentoo.org/gentoo-portage"
USE="x86 S3TC X acpi acpi4linux activefilter alsa amd apache2 apm autofs berkdb bitmap-fonts cacheemu cgi chroot clanVoice cli codecs cracklib crypt cups dedicated dga dhcp distribution divx4linux dlloader dri dvd dvdread elibc_glibc emboss encode esd examples ext-png ext-zlib faad fastcgi fbcon firefox flash foomaticdb freetype gdbm gif glade gmail gnome gpm gstreamer gtk gtk2 i8x0 iconv imlib innodb input_devices_evdev input_devices_keyboard input_devices_mouse ipalias ipv6 ipv6arpa ithreads j-noaim j-nojud j-nomuconf j-noyahoo jack-caps javascript jikes jpeg justify kernel_linux libg++ libwww lids linguas_fr mad md5sum memlimit mikmod mmx mmx2 motif mozctl mozinterfaceinfo moznoirc mp3 mpeg mpeg4 mplayer msn music native ncurses net nls nptl nptlonly nvidia oav ogg opengl openssh oss pam pcre perl php png posix pppd prelude pthreads python qt3 qt4 quicktime readline real reflection regexp ruby18 sdl session spell spl src sse sse2 ssl tcpd transcode truetype truetype-fonts type1-fonts udev uptimed usagi userland_GNU video_cards_nvidia videos vim vim-with-x vorbis win32codecs wxwin wxwindows xchatdccserver xchattext xface xfs xml xorg xv zlib"
Unset:  CTARGET, EMERGE_DEFAULT_OPTS, INSTALL_MASK, PORTAGE_RSYNC_EXTRA_OPTS

Erreur : 
>>> Source unpacked.
>>> Compiling source in /mnt/Z/portage/portage/curl-7.15.1-r1/work/curl-7.15.1 ...
 * econf: updating curl-7.15.1/config.guess with /usr/share/gnuconfig/config.guess
 * econf: updating curl-7.15.1/config.sub with /usr/share/gnuconfig/config.sub
./configure --prefix=/usr --host=i686-pc-linux-gnu --mandir=/usr/share/man --infodir=/usr/share/info --datadir=/usr/share --sysconfdir=/etc --localstatedir=/var/lib --disable-ldap --without-libidn --disable-gssapi --enable-ipv6 --enable-http --enable-ftp --enable-gopher --enable-file --enable-dict --enable-manual --enable-telnet --enable-nonblocking --enable-largefile --disable-ares --disable-krb4 --without-gnutls --with-ssl=/usr --build=i686-pc-linux-gnu
checking whether to enable maintainer-specific portions of Makefiles... no
checking for sed... /bin/sed
checking for i686-pc-linux-gnu-ar... i686-pc-linux-gnu-ar
checking for a BSD-compatible install... /bin/install -c
checking whether build environment is sane... yes
checking for gawk... gawk
checking whether make sets $(MAKE)... yes
checking curl version... 7.15.1
checking build system type... i686-pc-linux-gnu
checking host system type... i686-pc-linux-gnu
checking for style of include used by make... GNU
checking for i686-pc-linux-gnu-gcc... i686-pc-linux-gnu-gcc
checking for C compiler default output file name... a.out
checking whether the C compiler works... yes
checking whether we are cross compiling... no
checking for suffix of executables... 
checking for suffix of object files... o
checking whether we are using the GNU C compiler... yes
checking whether i686-pc-linux-gnu-gcc accepts -g... yes
checking for i686-pc-linux-gnu-gcc option to accept ANSI C... none needed
checking dependency style of i686-pc-linux-gnu-gcc... gcc3
checking how to run the C preprocessor... i686-pc-linux-gnu-gcc -E
checking for egrep... grep -E
checking for AIX... no
checking for i686-pc-linux-gnu-gcc... (cached) i686-pc-linux-gnu-gcc
checking whether we are using the GNU C compiler... (cached) yes
checking whether i686-pc-linux-gnu-gcc accepts -g... (cached) yes
checking for i686-pc-linux-gnu-gcc option to accept ANSI C... (cached) none needed
checking dependency style of i686-pc-linux-gnu-gcc... (cached) gcc3
checking for special C compiler options needed for large files... no
checking for _FILE_OFFSET_BITS value needed for large files... 64
checking for _LARGE_FILES value needed for large files... no
checking for a sed that does not truncate output... /bin/sed
checking for ld used by i686-pc-linux-gnu-gcc... /usr/i686-pc-linux-gnu/bin/ld
checking if the linker (/usr/i686-pc-linux-gnu/bin/ld) is GNU ld... yes
checking for /usr/i686-pc-linux-gnu/bin/ld option to reload object files... -r
checking for BSD-compatible nm... /usr/bin/i686-pc-linux-gnu-nm -B
checking whether ln -s works... yes
checking how to recognise dependent libraries... pass_all
checking for ANSI C header files... yes
checking for sys/types.h... yes
checking for sys/stat.h... yes
checking for stdlib.h... yes
checking for string.h... yes
checking for memory.h... yes
checking for strings.h... yes
checking for inttypes.h... yes
checking for stdint.h... yes
checking for unistd.h... yes
checking dlfcn.h usability... yes
checking dlfcn.h presence... yes
checking for dlfcn.h... yes
checking for i686-pc-linux-gnu-g++... i686-pc-linux-gnu-g++
checking whether we are using the GNU C++ compiler... yes
checking whether i686-pc-linux-gnu-g++ accepts -g... yes
checking dependency style of i686-pc-linux-gnu-g++... gcc3
checking how to run the C++ preprocessor... i686-pc-linux-gnu-g++ -E
checking for i686-pc-linux-gnu-g77... no
checking for i686-pc-linux-gnu-f77... no
checking for i686-pc-linux-gnu-xlf... no
checking for i686-pc-linux-gnu-frt... no
checking for i686-pc-linux-gnu-pgf77... no
checking for i686-pc-linux-gnu-fort77... no
checking for i686-pc-linux-gnu-fl32... no
checking for i686-pc-linux-gnu-af77... no
checking for i686-pc-linux-gnu-f90... no
checking for i686-pc-linux-gnu-xlf90... no
checking for i686-pc-linux-gnu-pgf90... no
checking for i686-pc-linux-gnu-epcf90... no
checking for i686-pc-linux-gnu-f95... no
checking for i686-pc-linux-gnu-fort... no
checking for i686-pc-linux-gnu-xlf95... no
checking for i686-pc-linux-gnu-ifc... no
checking for i686-pc-linux-gnu-efc... no
checking for i686-pc-linux-gnu-pgf95... no
checking for i686-pc-linux-gnu-lf95... no
checking for i686-pc-linux-gnu-gfortran... no
checking for g77... no
checking for f77... no
checking for xlf... no
checking for frt... no
checking for pgf77... no
checking for fort77... no
checking for fl32... no
checking for af77... no
checking for f90... no
checking for xlf90... no
checking for pgf90... no
checking for epcf90... no
checking for f95... no
checking for fort... no
checking for xlf95... no
checking for ifc... no
checking for efc... no
checking for pgf95... no
checking for lf95... no
checking for gfortran... no
checking whether we are using the GNU Fortran 77 compiler... no
checking whether  accepts -g... no
checking the maximum length of command line arguments... 32768
checking command to parse /usr/bin/i686-pc-linux-gnu-nm -B output from i686-pc-linux-gnu-gcc object... ok
checking for objdir... .libs
checking for i686-pc-linux-gnu-ar... (cached) i686-pc-linux-gnu-ar
checking for i686-pc-linux-gnu-ranlib... i686-pc-linux-gnu-ranlib
checking for i686-pc-linux-gnu-strip... i686-pc-linux-gnu-strip
checking if i686-pc-linux-gnu-gcc static flag  works... yes
checking if i686-pc-linux-gnu-gcc supports -fno-rtti -fno-exceptions... no
checking for i686-pc-linux-gnu-gcc option to produce PIC... -fPIC
checking if i686-pc-linux-gnu-gcc PIC flag -fPIC works... yes
checking if i686-pc-linux-gnu-gcc supports -c -o file.o... yes
checking whether the i686-pc-linux-gnu-gcc linker (/usr/i686-pc-linux-gnu/bin/ld) supports shared libraries... yes
checking whether -lc should be explicitly linked in... no
checking dynamic linker characteristics... GNU/Linux ld.so
checking how to hardcode library paths into programs... immediate
checking whether stripping libraries is possible... yes
checking if libtool supports shared libraries... yes
checking whether to build shared libraries... yes
checking whether to build static libraries... yes
configure: creating libtool
appending configuration tag "CXX" to libtool
checking for ld used by i686-pc-linux-gnu-g++... /usr/i686-pc-linux-gnu/bin/ld
checking if the linker (/usr/i686-pc-linux-gnu/bin/ld) is GNU ld... yes
checking whether the i686-pc-linux-gnu-g++ linker (/usr/i686-pc-linux-gnu/bin/ld) supports shared libraries... yes
checking for i686-pc-linux-gnu-g++ option to produce PIC... -fPIC
checking if i686-pc-linux-gnu-g++ PIC flag -fPIC works... yes
checking if i686-pc-linux-gnu-g++ supports -c -o file.o... yes
checking whether the i686-pc-linux-gnu-g++ linker (/usr/i686-pc-linux-gnu/bin/ld) supports shared libraries... yes
checking dynamic linker characteristics... GNU/Linux ld.so
checking how to hardcode library paths into programs... immediate
checking whether stripping libraries is possible... yes
appending configuration tag "F77" to libtool
checking if we need -no-undefined... no
checking if we need -mimpure-text... no
checking if we need BUILDING_LIBCURL... no
checking whether make sets $(MAKE)... (cached) yes
checking whether to support http... yes
checking whether to support ftp... yes
checking whether to support gopher... yes
checking whether to support file... yes
checking whether to support ldap... no
checking whether to support dict... yes
checking whether to support telnet... yes
checking whether to support tftp... yes
checking whether to provide built-in manual... yes
checking for gethostbyname... yes
checking for strcasecmp... yes
checking for connect... yes
checking for dlclose... no
checking for dlopen in -ldl... yes
checking whether to use libgcc... no
checking for timeGetTime in winmm... no
checking whether to enable ipv6... yes
checking for working getaddrinfo... yes
checking for working NI_WITHSCOPEID... no
checking non-blocking sockets style... O_NONBLOCK
checking if argv can be written to... yes
checking if Kerberos4 support is requested... no
checking if SPNEGO support is requested... no
checking if GSSAPI support is requested... no
checking for gdi32... no
checking for CRYPTO_lock in -lcrypto... yes
checking for SSL_connect in -lssl... yes
checking openssl/x509.h usability... yes
checking openssl/x509.h presence... yes
checking for openssl/x509.h... yes
checking openssl/rsa.h usability... yes
checking openssl/rsa.h presence... yes
checking for openssl/rsa.h... yes
checking openssl/crypto.h usability... yes
checking openssl/crypto.h presence... yes
checking for openssl/crypto.h... yes
checking openssl/pem.h usability... yes
checking openssl/pem.h presence... yes
checking for openssl/pem.h... yes
checking openssl/ssl.h usability... yes
checking openssl/ssl.h presence... yes
checking for openssl/ssl.h... yes
checking openssl/err.h usability... yes
checking openssl/err.h presence... yes
checking for openssl/err.h... yes
checking openssl/pkcs12.h usability... yes
checking openssl/pkcs12.h presence... yes
checking for openssl/pkcs12.h... yes
checking for ENGINE_init... yes
checking openssl/engine.h usability... yes
checking openssl/engine.h presence... yes
checking for openssl/engine.h... yes
checking for ENGINE_load_builtin_engines... yes
checking for RAND_status... yes
checking for RAND_screen... no
checking for RAND_egd... yes
checking for CRYPTO_cleanup_all_ex_data... yes
configure: Added /usr/lib to LD_LIBRARY_PATH
checking for "/dev/urandom"... yes
checking CA cert bundle install path... ${prefix}/share/curl/curl-ca-bundle.crt
checking for inflateEnd in -lz... yes
checking zlib.h usability... yes
checking zlib.h presence... yes
checking for zlib.h... yes
configure: found both libz and libz.h header
checking whether to build with libidn... no
checking AIX 4.3 or later... no
checking for inet_ntoa_r... no
checking for localtime_r... yes
checking whether localtime_r is declared... yes
checking for strerror_r... yes
checking whether strerror_r is declared... yes
checking for a glibc strerror_r API... no
checking for a POSIX strerror_r API... yes
checking if gmtime_r exists and works... yes
checking for ANSI C header files... (cached) yes
checking for sys/types.h... (cached) yes
checking for sys/time.h... yes
checking for sys/select.h... yes
checking for sys/socket.h... yes
checking for sys/ioctl.h... yes
checking for assert.h... yes
checking for unistd.h... (cached) yes
checking for malloc.h... yes
checking for stdlib.h... (cached) yes
checking for limits.h... yes
checking for arpa/inet.h... yes
checking for net/if.h... yes
checking for netinet/in.h... yes
checking for netinet/tcp.h... yes
checking for netdb.h... yes
checking for sys/sockio.h... no
checking for sys/stat.h... (cached) yes
checking for sys/param.h... yes
checking for termios.h... yes
checking for termio.h... yes
checking for sgtty.h... yes
checking for fcntl.h... yes
checking for dlfcn.h... (cached) yes
checking for alloca.h... yes
checking for winsock.h... no
checking for winsock2.h... no
checking for time.h... yes
checking for io.h... yes
checking for pwd.h... yes
checking for utime.h... yes
checking for sys/utime.h... no
checking for sys/poll.h... yes
checking for sys/resource.h... yes
checking for libgen.h... yes
checking for locale.h... yes
checking for errno.h... yes
checking for arpa/tftp.h... yes
checking for sys/filio.h... no
checking for setjmp.h... yes
checking for an ANSI C-conforming const... yes
checking for size_t... yes
checking whether time.h and sys/time.h may both be included... yes
checking for curl_off_t... yes
checking size of curl_off_t... 8
checking for size_t... (cached) yes
checking size of size_t... 4
checking for long... yes
checking size of long... 4
checking for time_t... yes
checking size of time_t... 4
checking for long long... yes
checking if numberLL works... yes
checking for ssize_t... yes
checking for socklen_t... yes
checking for in_addr_t... yes
checking for struct sockaddr_storage... yes
checking for sys/select.h... (cached) yes
checking for sys/socket.h... (cached) yes
checking types of arguments for select... int,fd_set *,struct timeval *
checking return type of signal handlers... void
checking for strtoll... yes
checking for socket... yes
checking for select... yes
checking for strdup... yes
checking for strstr... yes
checking for strtok_r... yes
checking for uname... yes
checking for strcasecmp... (cached) yes
checking for stricmp... no
checking deeper for stricmp... but still no
checking for strcmpi... no
checking deeper for strcmpi... but still no
checking for gethostbyaddr... yes
checking for gettimeofday... yes
checking for inet_addr... yes
checking for inet_ntoa... yes
checking for inet_pton... yes
checking for perror... yes
checking for closesocket... no
checking deeper for closesocket... but still no
checking for siginterrupt... yes
checking for sigaction... yes
checking for signal... yes
checking for getpass_r... no
checking deeper for getpass_r... but still no
checking for strlcat... no
checking deeper for strlcat... but still no
checking for getpwuid... yes
checking for geteuid... yes
checking for dlopen... yes
checking for utime... yes
checking for sigsetjmp... no
checking deeper for sigsetjmp... but still no
checking for basename... yes
checking for setlocale... yes
checking for ftruncate... yes
checking for pipe... yes
checking for poll... yes
checking for getrlimit... yes
checking for setrlimit... yes
checking for sigsetjmp defined as macro... yes
checking whether basename is declared... yes
checking whether inet_pton is declared... yes
checking if we are Mac OS X (to disable poll)... no
checking if poll works with NULL inputs... yes
checking for perl... /usr/bin/perl
checking for gnroff... no
checking for nroff... /usr/bin/nroff
checking how to use *nroff to get plain text from man pages... -man
checking whether to enable ares... no
checking whether to enable verbose strings... yes
checking whether to enable SSPI support (win32 builds only)... no
checking whether to enable debug options... no
checking whether to enable cryptographic authentication methods... yes
checking whether to enable support for cookies... yes
configure: creating ./config.status
config.status: creating Makefile
config.status: creating docs/Makefile
config.status: creating docs/examples/Makefile
config.status: creating docs/libcurl/Makefile
config.status: creating include/Makefile
config.status: creating include/curl/Makefile
config.status: creating src/Makefile
config.status: creating lib/Makefile
config.status: creating tests/Makefile
config.status: creating tests/data/Makefile
config.status: creating tests/server/Makefile
config.status: creating tests/libtest/Makefile
config.status: creating packages/Makefile
config.status: creating packages/Win32/Makefile
config.status: creating packages/Win32/cygwin/Makefile
config.status: creating packages/Linux/Makefile
config.status: creating packages/Linux/RPM/Makefile
config.status: creating packages/Linux/RPM/curl.spec
config.status: creating packages/Linux/RPM/curl-ssl.spec
config.status: creating packages/Solaris/Makefile
config.status: creating packages/DOS/Makefile
config.status: creating packages/EPM/curl.list
config.status: creating packages/EPM/Makefile
config.status: creating packages/vms/Makefile
config.status: creating curl-config
config.status: creating libcurl.pc
config.status: creating lib/config.h
config.status: creating src/config.h
config.status: executing depfiles commands
configure: Configured to build curl/libcurl:

  curl version:    7.15.1
  Host setup:      i686-pc-linux-gnu
  Install prefix:  /usr
  Compiler:        i686-pc-linux-gnu-gcc
  SSL support:     enabled (OpenSSL)
  zlib support:    enabled
  krb4 support:    no      (--with-krb4*)
  GSSAPI support:  no      (--with-gssapi)
  SPNEGO support:  no      (--with-spnego)
  c-ares support:  no      (--enable-ares)
  ipv6 support:    enabled
  IDN support:     no      (--with-libidn)
  Build libcurl:   Shared=yes, Static=yes
  Built-in manual: enabled
  Verbose errors:  enabled (--disable-verbose)
  SSPI support:    no      (--enable-sspi)
  ca cert path:    ${prefix}/share/curl/curl-ca-bundle.crt
Making all in lib
make[1]: entrant dans le répertoire « /mnt/Z/portage/portage/curl-7.15.1-r1/work/curl-7.15.1/lib »
echo "/* This file is generated automatically */" > ../lib/ca-bundle.h
echo '#define CURL_CA_BUNDLE "/usr/share/curl/curl-ca-bundle.crt"' >> ../lib/ca-bundle.h
make  all-am
make[2]: entrant dans le répertoire « /mnt/Z/portage/portage/curl-7.15.1-r1/work/curl-7.15.1/lib »
if /bin/sh ../libtool --tag=CC --mode=compile i686-pc-linux-gnu-gcc -DHAVE_CONFIG_H  -I../include -I../lib -I../lib  -I/usr/include/openssl -I/usr/include  -march=pentium4 -O2 -pipe -fomit-frame-pointer -mfpmath=sse -funroll-loops -finline-functions -MT file.lo -MD -MP -MF ".deps/file.Tpo" -c -o file.lo file.c; \
        then mv -f ".deps/file.Tpo" ".deps/file.Plo"; else rm -f ".deps/file.Tpo"; exit 1; fi
if /bin/sh ../libtool --tag=CC --mode=compile i686-pc-linux-gnu-gcc -DHAVE_CONFIG_H  -I../include -I../lib -I../lib  -I/usr/include/openssl -I/usr/include  -march=pentium4 -O2 -pipe -fomit-frame-pointer -mfpmath=sse -funroll-loops -finline-functions -MT timeval.lo -MD -MP -MF ".deps/timeval.Tpo" -c -o timeval.lo timeval.c; \
        then mv -f ".deps/timeval.Tpo" ".deps/timeval.Plo"; else rm -f ".deps/timeval.Tpo"; exit 1; fi
if /bin/sh ../libtool --tag=CC --mode=compile i686-pc-linux-gnu-gcc -DHAVE_CONFIG_H  -I../include -I../lib -I../lib  -I/usr/include/openssl -I/usr/include  -march=pentium4 -O2 -pipe -fomit-frame-pointer -mfpmath=sse -funroll-loops -finline-functions -MT base64.lo -MD -MP -MF ".deps/base64.Tpo" -c -o base64.lo base64.c; \
        then mv -f ".deps/base64.Tpo" ".deps/base64.Plo"; else rm -f ".deps/base64.Tpo"; exit 1; fi
if /bin/sh ../libtool --tag=CC --mode=compile i686-pc-linux-gnu-gcc -DHAVE_CONFIG_H  -I../include -I../lib -I../lib  -I/usr/include/openssl -I/usr/include  -march=pentium4 -O2 -pipe -fomit-frame-pointer -mfpmath=sse -funroll-loops -finline-functions -MT hostip.lo -MD -MP -MF ".deps/hostip.Tpo" -c -o hostip.lo hostip.c; \
        then mv -f ".deps/hostip.Tpo" ".deps/hostip.Plo"; else rm -f ".deps/hostip.Tpo"; exit 1; fi
mkdir .libs
 i686-pc-linux-gnu-gcc -DHAVE_CONFIG_H -I../include -I../lib -I../lib -I/usr/include/openssl -I/usr/include -march=pentium4 -O2 -pipe -fomit-frame-pointer -mfpmath=sse -funroll-loops -finline-functions -MT timeval.lo -MD -MP -MF .deps/timeval.Tpo -c timeval.c  -fPIC -DPIC -o .libs/timeval.o
 i686-pc-linux-gnu-gcc -DHAVE_CONFIG_H -I../include -I../lib -I../lib -I/usr/include/openssl -I/usr/include -march=pentium4 -O2 -pipe -fomit-frame-pointer -mfpmath=sse -funroll-loops -finline-functions -MT hostip.lo -MD -MP -MF .deps/hostip.Tpo -c hostip.c  -fPIC -DPIC -o .libs/hostip.o
 i686-pc-linux-gnu-gcc -DHAVE_CONFIG_H -I../include -I../lib -I../lib -I/usr/include/openssl -I/usr/include -march=pentium4 -O2 -pipe -fomit-frame-pointer -mfpmath=sse -funroll-loops -finline-functions -MT timeval.lo -MD -MP -MF .deps/timeval.Tpo -c timeval.c -o timeval.o >/dev/null 2>&1
 i686-pc-linux-gnu-gcc -DHAVE_CONFIG_H -I../include -I../lib -I../lib -I/usr/include/openssl -I/usr/include -march=pentium4 -O2 -pipe -fomit-frame-pointer -mfpmath=sse -funroll-loops -finline-functions -MT hostip.lo -MD -MP -MF .deps/hostip.Tpo -c hostip.c -o hostip.o >/dev/null 2>&1
if /bin/sh ../libtool --tag=CC --mode=compile i686-pc-linux-gnu-gcc -DHAVE_CONFIG_H  -I../include -I../lib -I../lib  -I/usr/include/openssl -I/usr/include  -march=pentium4 -O2 -pipe -fomit-frame-pointer -mfpmath=sse -funroll-loops -finline-functions -MT progress.lo -MD -MP -MF ".deps/progress.Tpo" -c -o progress.lo progress.c; \
        then mv -f ".deps/progress.Tpo" ".deps/progress.Plo"; else rm -f ".deps/progress.Tpo"; exit 1; fi
if /bin/sh ../libtool --tag=CC --mode=compile i686-pc-linux-gnu-gcc -DHAVE_CONFIG_H  -I../include -I../lib -I../lib  -I/usr/include/openssl -I/usr/include  -march=pentium4 -O2 -pipe -fomit-frame-pointer -mfpmath=sse -funroll-loops -finline-functions -MT formdata.lo -MD -MP -MF ".deps/formdata.Tpo" -c -o formdata.lo formdata.c; \
        then mv -f ".deps/formdata.Tpo" ".deps/formdata.Plo"; else rm -f ".deps/formdata.Tpo"; exit 1; fi
 i686-pc-linux-gnu-gcc -DHAVE_CONFIG_H -I../include -I../lib -I../lib -I/usr/include/openssl -I/usr/include -march=pentium4 -O2 -pipe -fomit-frame-pointer -mfpmath=sse -funroll-loops -finline-functions -MT file.lo -MD -MP -MF .deps/file.Tpo -c file.c  -fPIC -DPIC -o .libs/file.o
 i686-pc-linux-gnu-gcc -DHAVE_CONFIG_H -I../include -I../lib -I../lib -I/usr/include/openssl -I/usr/include -march=pentium4 -O2 -pipe -fomit-frame-pointer -mfpmath=sse -funroll-loops -finline-functions -MT base64.lo -MD -MP -MF .deps/base64.Tpo -c base64.c  -fPIC -DPIC -o .libs/base64.o
 i686-pc-linux-gnu-gcc -DHAVE_CONFIG_H -I../include -I../lib -I../lib -I/usr/include/openssl -I/usr/include -march=pentium4 -O2 -pipe -fomit-frame-pointer -mfpmath=sse -funroll-loops -finline-functions -MT file.lo -MD -MP -MF .deps/file.Tpo -c file.c -o file.o >/dev/null 2>&1
 i686-pc-linux-gnu-gcc -DHAVE_CONFIG_H -I../include -I../lib -I../lib -I/usr/include/openssl -I/usr/include -march=pentium4 -O2 -pipe -fomit-frame-pointer -mfpmath=sse -funroll-loops -finline-functions -MT progress.lo -MD -MP -MF .deps/progress.Tpo -c progress.c  -fPIC -DPIC -o .libs/progress.o
 i686-pc-linux-gnu-gcc -DHAVE_CONFIG_H -I../include -I../lib -I../lib -I/usr/include/openssl -I/usr/include -march=pentium4 -O2 -pipe -fomit-frame-pointer -mfpmath=sse -funroll-loops -finline-functions -MT base64.lo -MD -MP -MF .deps/base64.Tpo -c base64.c -o base64.o >/dev/null 2>&1
 i686-pc-linux-gnu-gcc -DHAVE_CONFIG_H -I../include -I../lib -I../lib -I/usr/include/openssl -I/usr/include -march=pentium4 -O2 -pipe -fomit-frame-pointer -mfpmath=sse -funroll-loops -finline-functions -MT formdata.lo -MD -MP -MF .deps/formdata.Tpo -c formdata.c  -fPIC -DPIC -o .libs/formdata.o
if /bin/sh ../libtool --tag=CC --mode=compile i686-pc-linux-gnu-gcc -DHAVE_CONFIG_H  -I../include -I../lib -I../lib  -I/usr/include/openssl -I/usr/include  -march=pentium4 -O2 -pipe -fomit-frame-pointer -mfpmath=sse -funroll-loops -finline-functions -MT cookie.lo -MD -MP -MF ".deps/cookie.Tpo" -c -o cookie.lo cookie.c; \
        then mv -f ".deps/cookie.Tpo" ".deps/cookie.Plo"; else rm -f ".deps/cookie.Tpo"; exit 1; fi
 i686-pc-linux-gnu-gcc -DHAVE_CONFIG_H -I../include -I../lib -I../lib -I/usr/include/openssl -I/usr/include -march=pentium4 -O2 -pipe -fomit-frame-pointer -mfpmath=sse -funroll-loops -finline-functions -MT progress.lo -MD -MP -MF .deps/progress.Tpo -c progress.c -o progress.o >/dev/null 2>&1
if /bin/sh ../libtool --tag=CC --mode=compile i686-pc-linux-gnu-gcc -DHAVE_CONFIG_H  -I../include -I../lib -I../lib  -I/usr/include/openssl -I/usr/include  -march=pentium4 -O2 -pipe -fomit-frame-pointer -mfpmath=sse -funroll-loops -finline-functions -MT http.lo -MD -MP -MF ".deps/http.Tpo" -c -o http.lo http.c; \
        then mv -f ".deps/http.Tpo" ".deps/http.Plo"; else rm -f ".deps/http.Tpo"; exit 1; fi
 i686-pc-linux-gnu-gcc -DHAVE_CONFIG_H -I../include -I../lib -I../lib -I/usr/include/openssl -I/usr/include -march=pentium4 -O2 -pipe -fomit-frame-pointer -mfpmath=sse -funroll-loops -finline-functions -MT formdata.lo -MD -MP -MF .deps/formdata.Tpo -c formdata.c -o formdata.o >/dev/null 2>&1
if /bin/sh ../libtool --tag=CC --mode=compile i686-pc-linux-gnu-gcc -DHAVE_CONFIG_H  -I../include -I../lib -I../lib  -I/usr/include/openssl -I/usr/include  -march=pentium4 -O2 -pipe -fomit-frame-pointer -mfpmath=sse -funroll-loops -finline-functions -MT sendf.lo -MD -MP -MF ".deps/sendf.Tpo" -c -o sendf.lo sendf.c; \
        then mv -f ".deps/sendf.Tpo" ".deps/sendf.Plo"; else rm -f ".deps/sendf.Tpo"; exit 1; fi
 i686-pc-linux-gnu-gcc -DHAVE_CONFIG_H -I../include -I../lib -I../lib -I/usr/include/openssl -I/usr/include -march=pentium4 -O2 -pipe -fomit-frame-pointer -mfpmath=sse -funroll-loops -finline-functions -MT http.lo -MD -MP -MF .deps/http.Tpo -c http.c  -fPIC -DPIC -o .libs/http.o
 i686-pc-linux-gnu-gcc -DHAVE_CONFIG_H -I../include -I../lib -I../lib -I/usr/include/openssl -I/usr/include -march=pentium4 -O2 -pipe -fomit-frame-pointer -mfpmath=sse -funroll-loops -finline-functions -MT cookie.lo -MD -MP -MF .deps/cookie.Tpo -c cookie.c  -fPIC -DPIC -o .libs/cookie.o
if /bin/sh ../libtool --tag=CC --mode=compile i686-pc-linux-gnu-gcc -DHAVE_CONFIG_H  -I../include -I../lib -I../lib  -I/usr/include/openssl -I/usr/include  -march=pentium4 -O2 -pipe -fomit-frame-pointer -mfpmath=sse -funroll-loops -finline-functions -MT ftp.lo -MD -MP -MF ".deps/ftp.Tpo" -c -o ftp.lo ftp.c; \
        then mv -f ".deps/ftp.Tpo" ".deps/ftp.Plo"; else rm -f ".deps/ftp.Tpo"; exit 1; fi
 i686-pc-linux-gnu-gcc -DHAVE_CONFIG_H -I../include -I../lib -I../lib -I/usr/include/openssl -I/usr/include -march=pentium4 -O2 -pipe -fomit-frame-pointer -mfpmath=sse -funroll-loops -finline-functions -MT sendf.lo -MD -MP -MF .deps/sendf.Tpo -c sendf.c  -fPIC -DPIC -o .libs/sendf.o
 i686-pc-linux-gnu-gcc -DHAVE_CONFIG_H -I../include -I../lib -I../lib -I/usr/include/openssl -I/usr/include -march=pentium4 -O2 -pipe -fomit-frame-pointer -mfpmath=sse -funroll-loops -finline-functions -MT cookie.lo -MD -MP -MF .deps/cookie.Tpo -c cookie.c -o cookie.o >/dev/null 2>&1
 i686-pc-linux-gnu-gcc -DHAVE_CONFIG_H -I../include -I../lib -I../lib -I/usr/include/openssl -I/usr/include -march=pentium4 -O2 -pipe -fomit-frame-pointer -mfpmath=sse -funroll-loops -finline-functions -MT sendf.lo -MD -MP -MF .deps/sendf.Tpo -c sendf.c -o sendf.o >/dev/null 2>&1
if /bin/sh ../libtool --tag=CC --mode=compile i686-pc-linux-gnu-gcc -DHAVE_CONFIG_H  -I../include -I../lib -I../lib  -I/usr/include/openssl -I/usr/include  -march=pentium4 -O2 -pipe -fomit-frame-pointer -mfpmath=sse -funroll-loops -finline-functions -MT url.lo -MD -MP -MF ".deps/url.Tpo" -c -o url.lo url.c; \
        then mv -f ".deps/url.Tpo" ".deps/url.Plo"; else rm -f ".deps/url.Tpo"; exit 1; fi
 i686-pc-linux-gnu-gcc -DHAVE_CONFIG_H -I../include -I../lib -I../lib -I/usr/include/openssl -I/usr/include -march=pentium4 -O2 -pipe -fomit-frame-pointer -mfpmath=sse -funroll-loops -finline-functions -MT http.lo -MD -MP -MF .deps/http.Tpo -c http.c -o http.o >/dev/null 2>&1
 i686-pc-linux-gnu-gcc -DHAVE_CONFIG_H -I../include -I../lib -I../lib -I/usr/include/openssl -I/usr/include -march=pentium4 -O2 -pipe -fomit-frame-pointer -mfpmath=sse -funroll-loops -finline-functions -MT ftp.lo -MD -MP -MF .deps/ftp.Tpo -c ftp.c  -fPIC -DPIC -o .libs/ftp.o
 i686-pc-linux-gnu-gcc -DHAVE_CONFIG_H -I../include -I../lib -I../lib -I/usr/include/openssl -I/usr/include -march=pentium4 -O2 -pipe -fomit-frame-pointer -mfpmath=sse -funroll-loops -finline-functions -MT url.lo -MD -MP -MF .deps/url.Tpo -c url.c  -fPIC -DPIC -o .libs/url.o
if /bin/sh ../libtool --tag=CC --mode=compile i686-pc-linux-gnu-gcc -DHAVE_CONFIG_H  -I../include -I../lib -I../lib  -I/usr/include/openssl -I/usr/include  -march=pentium4 -O2 -pipe -fomit-frame-pointer -mfpmath=sse -funroll-loops -finline-functions -MT dict.lo -MD -MP -MF ".deps/dict.Tpo" -c -o dict.lo dict.c; \
        then mv -f ".deps/dict.Tpo" ".deps/dict.Plo"; else rm -f ".deps/dict.Tpo"; exit 1; fi
 i686-pc-linux-gnu-gcc -DHAVE_CONFIG_H -I../include -I../lib -I../lib -I/usr/include/openssl -I/usr/include -march=pentium4 -O2 -pipe -fomit-frame-pointer -mfpmath=sse -funroll-loops -finline-functions -MT dict.lo -MD -MP -MF .deps/dict.Tpo -c dict.c  -fPIC -DPIC -o .libs/dict.o
 i686-pc-linux-gnu-gcc -DHAVE_CONFIG_H -I../include -I../lib -I../lib -I/usr/include/openssl -I/usr/include -march=pentium4 -O2 -pipe -fomit-frame-pointer -mfpmath=sse -funroll-loops -finline-functions -MT dict.lo -MD -MP -MF .deps/dict.Tpo -c dict.c -o dict.o >/dev/null 2>&1
if /bin/sh ../libtool --tag=CC --mode=compile i686-pc-linux-gnu-gcc -DHAVE_CONFIG_H  -I../include -I../lib -I../lib  -I/usr/include/openssl -I/usr/include  -march=pentium4 -O2 -pipe -fomit-frame-pointer -mfpmath=sse -funroll-loops -finline-functions -MT if2ip.lo -MD -MP -MF ".deps/if2ip.Tpo" -c -o if2ip.lo if2ip.c; \
        then mv -f ".deps/if2ip.Tpo" ".deps/if2ip.Plo"; else rm -f ".deps/if2ip.Tpo"; exit 1; fi
 i686-pc-linux-gnu-gcc -DHAVE_CONFIG_H -I../include -I../lib -I../lib -I/usr/include/openssl -I/usr/include -march=pentium4 -O2 -pipe -fomit-frame-pointer -mfpmath=sse -funroll-loops -finline-functions -MT if2ip.lo -MD -MP -MF .deps/if2ip.Tpo -c if2ip.c  -fPIC -DPIC -o .libs/if2ip.o
 i686-pc-linux-gnu-gcc -DHAVE_CONFIG_H -I../include -I../lib -I../lib -I/usr/include/openssl -I/usr/include -march=pentium4 -O2 -pipe -fomit-frame-pointer -mfpmath=sse -funroll-loops -finline-functions -MT if2ip.lo -MD -MP -MF .deps/if2ip.Tpo -c if2ip.c -o if2ip.o >/dev/null 2>&1
if /bin/sh ../libtool --tag=CC --mode=compile i686-pc-linux-gnu-gcc -DHAVE_CONFIG_H  -I../include -I../lib -I../lib  -I/usr/include/openssl -I/usr/include  -march=pentium4 -O2 -pipe -fomit-frame-pointer -mfpmath=sse -funroll-loops -finline-functions -MT speedcheck.lo -MD -MP -MF ".deps/speedcheck.Tpo" -c -o speedcheck.lo speedcheck.c; \
        then mv -f ".deps/speedcheck.Tpo" ".deps/speedcheck.Plo"; else rm -f ".deps/speedcheck.Tpo"; exit 1; fi
if /bin/sh ../libtool --tag=CC --mode=compile i686-pc-linux-gnu-gcc -DHAVE_CONFIG_H  -I../include -I../lib -I../lib  -I/usr/include/openssl -I/usr/include  -march=pentium4 -O2 -pipe -fomit-frame-pointer -mfpmath=sse -funroll-loops -finline-functions -MT ldap.lo -MD -MP -MF ".deps/ldap.Tpo" -c -o ldap.lo ldap.c; \
        then mv -f ".deps/ldap.Tpo" ".deps/ldap.Plo"; else rm -f ".deps/ldap.Tpo"; exit 1; fi
 i686-pc-linux-gnu-gcc -DHAVE_CONFIG_H -I../include -I../lib -I../lib -I/usr/include/openssl -I/usr/include -march=pentium4 -O2 -pipe -fomit-frame-pointer -mfpmath=sse -funroll-loops -finline-functions -MT speedcheck.lo -MD -MP -MF .deps/speedcheck.Tpo -c speedcheck.c  -fPIC -DPIC -o .libs/speedcheck.o
 i686-pc-linux-gnu-gcc -DHAVE_CONFIG_H -I../include -I../lib -I../lib -I/usr/include/openssl -I/usr/include -march=pentium4 -O2 -pipe -fomit-frame-pointer -mfpmath=sse -funroll-loops -finline-functions -MT speedcheck.lo -MD -MP -MF .deps/speedcheck.Tpo -c speedcheck.c -o speedcheck.o >/dev/null 2>&1
 i686-pc-linux-gnu-gcc -DHAVE_CONFIG_H -I../include -I../lib -I../lib -I/usr/include/openssl -I/usr/include -march=pentium4 -O2 -pipe -fomit-frame-pointer -mfpmath=sse -funroll-loops -finline-functions -MT url.lo -MD -MP -MF .deps/url.Tpo -c url.c -o url.o >/dev/null 2>&1
if /bin/sh ../libtool --tag=CC --mode=compile i686-pc-linux-gnu-gcc -DHAVE_CONFIG_H  -I../include -I../lib -I../lib  -I/usr/include/openssl -I/usr/include  -march=pentium4 -O2 -pipe -fomit-frame-pointer -mfpmath=sse -funroll-loops -finline-functions -MT ssluse.lo -MD -MP -MF ".deps/ssluse.Tpo" -c -o ssluse.lo ssluse.c; \
        then mv -f ".deps/ssluse.Tpo" ".deps/ssluse.Plo"; else rm -f ".deps/ssluse.Tpo"; exit 1; fi
 i686-pc-linux-gnu-gcc -DHAVE_CONFIG_H -I../include -I../lib -I../lib -I/usr/include/openssl -I/usr/include -march=pentium4 -O2 -pipe -fomit-frame-pointer -mfpmath=sse -funroll-loops -finline-functions -MT ftp.lo -MD -MP -MF .deps/ftp.Tpo -c ftp.c -o ftp.o >/dev/null 2>&1
 i686-pc-linux-gnu-gcc -DHAVE_CONFIG_H -I../include -I../lib -I../lib -I/usr/include/openssl -I/usr/include -march=pentium4 -O2 -pipe -fomit-frame-pointer -mfpmath=sse -funroll-loops -finline-functions -MT ldap.lo -MD -MP -MF .deps/ldap.Tpo -c ldap.c  -fPIC -DPIC -o .libs/ldap.o
 i686-pc-linux-gnu-gcc -DHAVE_CONFIG_H -I../include -I../lib -I../lib -I/usr/include/openssl -I/usr/include -march=pentium4 -O2 -pipe -fomit-frame-pointer -mfpmath=sse -funroll-loops -finline-functions -MT ldap.lo -MD -MP -MF .deps/ldap.Tpo -c ldap.c -o ldap.o >/dev/null 2>&1
if /bin/sh ../libtool --tag=CC --mode=compile i686-pc-linux-gnu-gcc -DHAVE_CONFIG_H  -I../include -I../lib -I../lib  -I/usr/include/openssl -I/usr/include  -march=pentium4 -O2 -pipe -fomit-frame-pointer -mfpmath=sse -funroll-loops -finline-functions -MT version.lo -MD -MP -MF ".deps/version.Tpo" -c -o version.lo version.c; \
        then mv -f ".deps/version.Tpo" ".deps/version.Plo"; else rm -f ".deps/version.Tpo"; exit 1; fi
 i686-pc-linux-gnu-gcc -DHAVE_CONFIG_H -I../include -I../lib -I../lib -I/usr/include/openssl -I/usr/include -march=pentium4 -O2 -pipe -fomit-frame-pointer -mfpmath=sse -funroll-loops -finline-functions -MT ssluse.lo -MD -MP -MF .deps/ssluse.Tpo -c ssluse.c  -fPIC -DPIC -o .libs/ssluse.o
 i686-pc-linux-gnu-gcc -DHAVE_CONFIG_H -I../include -I../lib -I../lib -I/usr/include/openssl -I/usr/include -march=pentium4 -O2 -pipe -fomit-frame-pointer -mfpmath=sse -funroll-loops -finline-functions -MT version.lo -MD -MP -MF .deps/version.Tpo -c version.c  -fPIC -DPIC -o .libs/version.o
 i686-pc-linux-gnu-gcc -DHAVE_CONFIG_H -I../include -I../lib -I../lib -I/usr/include/openssl -I/usr/include -march=pentium4 -O2 -pipe -fomit-frame-pointer -mfpmath=sse -funroll-loops -finline-functions -MT version.lo -MD -MP -MF .deps/version.Tpo -c version.c -o version.o >/dev/null 2>&1
 i686-pc-linux-gnu-gcc -DHAVE_CONFIG_H -I../include -I../lib -I../lib -I/usr/include/openssl -I/usr/include -march=pentium4 -O2 -pipe -fomit-frame-pointer -mfpmath=sse -funroll-loops -finline-functions -MT ssluse.lo -MD -MP -MF .deps/ssluse.Tpo -c ssluse.c -o ssluse.o >/dev/null 2>&1
if /bin/sh ../libtool --tag=CC --mode=compile i686-pc-linux-gnu-gcc -DHAVE_CONFIG_H  -I../include -I../lib -I../lib  -I/usr/include/openssl -I/usr/include  -march=pentium4 -O2 -pipe -fomit-frame-pointer -mfpmath=sse -funroll-loops -finline-functions -MT getenv.lo -MD -MP -MF ".deps/getenv.Tpo" -c -o getenv.lo getenv.c; \
        then mv -f ".deps/getenv.Tpo" ".deps/getenv.Plo"; else rm -f ".deps/getenv.Tpo"; exit 1; fi
if /bin/sh ../libtool --tag=CC --mode=compile i686-pc-linux-gnu-gcc -DHAVE_CONFIG_H  -I../include -I../lib -I../lib  -I/usr/include/openssl -I/usr/include  -march=pentium4 -O2 -pipe -fomit-frame-pointer -mfpmath=sse -funroll-loops -finline-functions -MT escape.lo -MD -MP -MF ".deps/escape.Tpo" -c -o escape.lo escape.c; \
        then mv -f ".deps/escape.Tpo" ".deps/escape.Plo"; else rm -f ".deps/escape.Tpo"; exit 1; fi
 i686-pc-linux-gnu-gcc -DHAVE_CONFIG_H -I../include -I../lib -I../lib -I/usr/include/openssl -I/usr/include -march=pentium4 -O2 -pipe -fomit-frame-pointer -mfpmath=sse -funroll-loops -finline-functions -MT getenv.lo -MD -MP -MF .deps/getenv.Tpo -c getenv.c  -fPIC -DPIC -o .libs/getenv.o
 i686-pc-linux-gnu-gcc -DHAVE_CONFIG_H -I../include -I../lib -I../lib -I/usr/include/openssl -I/usr/include -march=pentium4 -O2 -pipe -fomit-frame-pointer -mfpmath=sse -funroll-loops -finline-functions -MT escape.lo -MD -MP -MF .deps/escape.Tpo -c escape.c  -fPIC -DPIC -o .libs/escape.o
if /bin/sh ../libtool --tag=CC --mode=compile i686-pc-linux-gnu-gcc -DHAVE_CONFIG_H  -I../include -I../lib -I../lib  -I/usr/include/openssl -I/usr/include  -march=pentium4 -O2 -pipe -fomit-frame-pointer -mfpmath=sse -funroll-loops -finline-functions -MT mprintf.lo -MD -MP -MF ".deps/mprintf.Tpo" -c -o mprintf.lo mprintf.c; \
        then mv -f ".deps/mprintf.Tpo" ".deps/mprintf.Plo"; else rm -f ".deps/mprintf.Tpo"; exit 1; fi
 i686-pc-linux-gnu-gcc -DHAVE_CONFIG_H -I../include -I../lib -I../lib -I/usr/include/openssl -I/usr/include -march=pentium4 -O2 -pipe -fomit-frame-pointer -mfpmath=sse -funroll-loops -finline-functions -MT getenv.lo -MD -MP -MF .deps/getenv.Tpo -c getenv.c -o getenv.o >/dev/null 2>&1
 i686-pc-linux-gnu-gcc -DHAVE_CONFIG_H -I../include -I../lib -I../lib -I/usr/include/openssl -I/usr/include -march=pentium4 -O2 -pipe -fomit-frame-pointer -mfpmath=sse -funroll-loops -finline-functions -MT mprintf.lo -MD -MP -MF .deps/mprintf.Tpo -c mprintf.c  -fPIC -DPIC -o .libs/mprintf.o
if /bin/sh ../libtool --tag=CC --mode=compile i686-pc-linux-gnu-gcc -DHAVE_CONFIG_H  -I../include -I../lib -I../lib  -I/usr/include/openssl -I/usr/include  -march=pentium4 -O2 -pipe -fomit-frame-pointer -mfpmath=sse -funroll-loops -finline-functions -MT telnet.lo -MD -MP -MF ".deps/telnet.Tpo" -c -o telnet.lo telnet.c; \
        then mv -f ".deps/telnet.Tpo" ".deps/telnet.Plo"; else rm -f ".deps/telnet.Tpo"; exit 1; fi
 i686-pc-linux-gnu-gcc -DHAVE_CONFIG_H -I../include -I../lib -I../lib -I/usr/include/openssl -I/usr/include -march=pentium4 -O2 -pipe -fomit-frame-pointer -mfpmath=sse -funroll-loops -finline-functions -MT escape.lo -MD -MP -MF .deps/escape.Tpo -c escape.c -o escape.o >/dev/null 2>&1
if /bin/sh ../libtool --tag=CC --mode=compile i686-pc-linux-gnu-gcc -DHAVE_CONFIG_H  -I../include -I../lib -I../lib  -I/usr/include/openssl -I/usr/include  -march=pentium4 -O2 -pipe -fomit-frame-pointer -mfpmath=sse -funroll-loops -finline-functions -MT netrc.lo -MD -MP -MF ".deps/netrc.Tpo" -c -o netrc.lo netrc.c; \
        then mv -f ".deps/netrc.Tpo" ".deps/netrc.Plo"; else rm -f ".deps/netrc.Tpo"; exit 1; fi
if /bin/sh ../libtool --tag=CC --mode=compile i686-pc-linux-gnu-gcc -DHAVE_CONFIG_H  -I../include -I../lib -I../lib  -I/usr/include/openssl -I/usr/include  -march=pentium4 -O2 -pipe -fomit-frame-pointer -mfpmath=sse -funroll-loops -finline-functions -MT getinfo.lo -MD -MP -MF ".deps/getinfo.Tpo" -c -o getinfo.lo getinfo.c; \
        then mv -f ".deps/getinfo.Tpo" ".deps/getinfo.Plo"; else rm -f ".deps/getinfo.Tpo"; exit 1; fi
 i686-pc-linux-gnu-gcc -DHAVE_CONFIG_H -I../include -I../lib -I../lib -I/usr/include/openssl -I/usr/include -march=pentium4 -O2 -pipe -fomit-frame-pointer -mfpmath=sse -funroll-loops -finline-functions -MT netrc.lo -MD -MP -MF .deps/netrc.Tpo -c netrc.c  -fPIC -DPIC -o .libs/netrc.o
 i686-pc-linux-gnu-gcc -DHAVE_CONFIG_H -I../include -I../lib -I../lib -I/usr/include/openssl -I/usr/include -march=pentium4 -O2 -pipe -fomit-frame-pointer -mfpmath=sse -funroll-loops -finline-functions -MT mprintf.lo -MD -MP -MF .deps/mprintf.Tpo -c mprintf.c -o mprintf.o >/dev/null 2>&1
 i686-pc-linux-gnu-gcc -DHAVE_CONFIG_H -I../include -I../lib -I../lib -I/usr/include/openssl -I/usr/include -march=pentium4 -O2 -pipe -fomit-frame-pointer -mfpmath=sse -funroll-loops -finline-functions -MT netrc.lo -MD -MP -MF .deps/netrc.Tpo -c netrc.c -o netrc.o >/dev/null 2>&1
 i686-pc-linux-gnu-gcc -DHAVE_CONFIG_H -I../include -I../lib -I../lib -I/usr/include/openssl -I/usr/include -march=pentium4 -O2 -pipe -fomit-frame-pointer -mfpmath=sse -funroll-loops -finline-functions -MT telnet.lo -MD -MP -MF .deps/telnet.Tpo -c telnet.c  -fPIC -DPIC -o .libs/telnet.o
 i686-pc-linux-gnu-gcc -DHAVE_CONFIG_H -I../include -I../lib -I../lib -I/usr/include/openssl -I/usr/include -march=pentium4 -O2 -pipe -fomit-frame-pointer -mfpmath=sse -funroll-loops -finline-functions -MT getinfo.lo -MD -MP -MF .deps/getinfo.Tpo -c getinfo.c  -fPIC -DPIC -o .libs/getinfo.o
if /bin/sh ../libtool --tag=CC --mode=compile i686-pc-linux-gnu-gcc -DHAVE_CONFIG_H  -I../include -I../lib -I../lib  -I/usr/include/openssl -I/usr/include  -march=pentium4 -O2 -pipe -fomit-frame-pointer -mfpmath=sse -funroll-loops -finline-functions -MT transfer.lo -MD -MP -MF ".deps/transfer.Tpo" -c -o transfer.lo transfer.c; \
        then mv -f ".deps/transfer.Tpo" ".deps/transfer.Plo"; else rm -f ".deps/transfer.Tpo"; exit 1; fi
if /bin/sh ../libtool --tag=CC --mode=compile i686-pc-linux-gnu-gcc -DHAVE_CONFIG_H  -I../include -I../lib -I../lib  -I/usr/include/openssl -I/usr/include  -march=pentium4 -O2 -pipe -fomit-frame-pointer -mfpmath=sse -funroll-loops -finline-functions -MT strequal.lo -MD -MP -MF ".deps/strequal.Tpo" -c -o strequal.lo strequal.c; \
        then mv -f ".deps/strequal.Tpo" ".deps/strequal.Plo"; else rm -f ".deps/strequal.Tpo"; exit 1; fi
 i686-pc-linux-gnu-gcc -DHAVE_CONFIG_H -I../include -I../lib -I../lib -I/usr/include/openssl -I/usr/include -march=pentium4 -O2 -pipe -fomit-frame-pointer -mfpmath=sse -funroll-loops -finline-functions -MT telnet.lo -MD -MP -MF .deps/telnet.Tpo -c telnet.c -o telnet.o >/dev/null 2>&1
 i686-pc-linux-gnu-gcc -DHAVE_CONFIG_H -I../include -I../lib -I../lib -I/usr/include/openssl -I/usr/include -march=pentium4 -O2 -pipe -fomit-frame-pointer -mfpmath=sse -funroll-loops -finline-functions -MT getinfo.lo -MD -MP -MF .deps/getinfo.Tpo -c getinfo.c -o getinfo.o >/dev/null 2>&1
 i686-pc-linux-gnu-gcc -DHAVE_CONFIG_H -I../include -I../lib -I../lib -I/usr/include/openssl -I/usr/include -march=pentium4 -O2 -pipe -fomit-frame-pointer -mfpmath=sse -funroll-loops -finline-functions -MT strequal.lo -MD -MP -MF .deps/strequal.Tpo -c strequal.c  -fPIC -DPIC -o .libs/strequal.o
 i686-pc-linux-gnu-gcc -DHAVE_CONFIG_H -I../include -I../lib -I../lib -I/usr/include/openssl -I/usr/include -march=pentium4 -O2 -pipe -fomit-frame-pointer -mfpmath=sse -funroll-loops -finline-functions -MT strequal.lo -MD -MP -MF .deps/strequal.Tpo -c strequal.c -o strequal.o >/dev/null 2>&1
if /bin/sh ../libtool --tag=CC --mode=compile i686-pc-linux-gnu-gcc -DHAVE_CONFIG_H  -I../include -I../lib -I../lib  -I/usr/include/openssl -I/usr/include  -march=pentium4 -O2 -pipe -fomit-frame-pointer -mfpmath=sse -funroll-loops -finline-functions -MT easy.lo -MD -MP -MF ".deps/easy.Tpo" -c -o easy.lo easy.c; \
        then mv -f ".deps/easy.Tpo" ".deps/easy.Plo"; else rm -f ".deps/easy.Tpo"; exit 1; fi
 i686-pc-linux-gnu-gcc -DHAVE_CONFIG_H -I../include -I../lib -I../lib -I/usr/include/openssl -I/usr/include -march=pentium4 -O2 -pipe -fomit-frame-pointer -mfpmath=sse -funroll-loops -finline-functions -MT transfer.lo -MD -MP -MF .deps/transfer.Tpo -c transfer.c  -fPIC -DPIC -o .libs/transfer.o
if /bin/sh ../libtool --tag=CC --mode=compile i686-pc-linux-gnu-gcc -DHAVE_CONFIG_H  -I../include -I../lib -I../lib  -I/usr/include/openssl -I/usr/include  -march=pentium4 -O2 -pipe -fomit-frame-pointer -mfpmath=sse -funroll-loops -finline-functions -MT security.lo -MD -MP -MF ".deps/security.Tpo" -c -o security.lo security.c; \
        then mv -f ".deps/security.Tpo" ".deps/security.Plo"; else rm -f ".deps/security.Tpo"; exit 1; fi
if /bin/sh ../libtool --tag=CC --mode=compile i686-pc-linux-gnu-gcc -DHAVE_CONFIG_H  -I../include -I../lib -I../lib  -I/usr/include/openssl -I/usr/include  -march=pentium4 -O2 -pipe -fomit-frame-pointer -mfpmath=sse -funroll-loops -finline-functions -MT krb4.lo -MD -MP -MF ".deps/krb4.Tpo" -c -o krb4.lo krb4.c; \
        then mv -f ".deps/krb4.Tpo" ".deps/krb4.Plo"; else rm -f ".deps/krb4.Tpo"; exit 1; fi
 i686-pc-linux-gnu-gcc -DHAVE_CONFIG_H -I../include -I../lib -I../lib -I/usr/include/openssl -I/usr/include -march=pentium4 -O2 -pipe -fomit-frame-pointer -mfpmath=sse -funroll-loops -finline-functions -MT security.lo -MD -MP -MF .deps/security.Tpo -c security.c  -fPIC -DPIC -o .libs/security.o
 i686-pc-linux-gnu-gcc -DHAVE_CONFIG_H -I../include -I../lib -I../lib -I/usr/include/openssl -I/usr/include -march=pentium4 -O2 -pipe -fomit-frame-pointer -mfpmath=sse -funroll-loops -finline-functions -MT security.lo -MD -MP -MF .deps/security.Tpo -c security.c -o security.o >/dev/null 2>&1
 i686-pc-linux-gnu-gcc -DHAVE_CONFIG_H -I../include -I../lib -I../lib -I/usr/include/openssl -I/usr/include -march=pentium4 -O2 -pipe -fomit-frame-pointer -mfpmath=sse -funroll-loops -finline-functions -MT easy.lo -MD -MP -MF .deps/easy.Tpo -c easy.c  -fPIC -DPIC -o .libs/easy.o
if /bin/sh ../libtool --tag=CC --mode=compile i686-pc-linux-gnu-gcc -DHAVE_CONFIG_H  -I../include -I../lib -I../lib  -I/usr/include/openssl -I/usr/include  -march=pentium4 -O2 -pipe -fomit-frame-pointer -mfpmath=sse -funroll-loops -finline-functions -MT memdebug.lo -MD -MP -MF ".deps/memdebug.Tpo" -c -o memdebug.lo memdebug.c; \
        then mv -f ".deps/memdebug.Tpo" ".deps/memdebug.Plo"; else rm -f ".deps/memdebug.Tpo"; exit 1; fi
 i686-pc-linux-gnu-gcc -DHAVE_CONFIG_H -I../include -I../lib -I../lib -I/usr/include/openssl -I/usr/include -march=pentium4 -O2 -pipe -fomit-frame-pointer -mfpmath=sse -funroll-loops -finline-functions -MT krb4.lo -MD -MP -MF .deps/krb4.Tpo -c krb4.c  -fPIC -DPIC -o .libs/krb4.o
 i686-pc-linux-gnu-gcc -DHAVE_CONFIG_H -I../include -I../lib -I../lib -I/usr/include/openssl -I/usr/include -march=pentium4 -O2 -pipe -fomit-frame-pointer -mfpmath=sse -funroll-loops -finline-functions -MT krb4.lo -MD -MP -MF .deps/krb4.Tpo -c krb4.c -o krb4.o >/dev/null 2>&1
if /bin/sh ../libtool --tag=CC --mode=compile i686-pc-linux-gnu-gcc -DHAVE_CONFIG_H  -I../include -I../lib -I../lib  -I/usr/include/openssl -I/usr/include  -march=pentium4 -O2 -pipe -fomit-frame-pointer -mfpmath=sse -funroll-loops -finline-functions -MT http_chunks.lo -MD -MP -MF ".deps/http_chunks.Tpo" -c -o http_chunks.lo http_chunks.c; \
        then mv -f ".deps/http_chunks.Tpo" ".deps/http_chunks.Plo"; else rm -f ".deps/http_chunks.Tpo"; exit 1; fi
 i686-pc-linux-gnu-gcc -DHAVE_CONFIG_H -I../include -I../lib -I../lib -I/usr/include/openssl -I/usr/include -march=pentium4 -O2 -pipe -fomit-frame-pointer -mfpmath=sse -funroll-loops -finline-functions -MT easy.lo -MD -MP -MF .deps/easy.Tpo -c easy.c -o easy.o >/dev/null 2>&1
 i686-pc-linux-gnu-gcc -DHAVE_CONFIG_H -I../include -I../lib -I../lib -I/usr/include/openssl -I/usr/include -march=pentium4 -O2 -pipe -fomit-frame-pointer -mfpmath=sse -funroll-loops -finline-functions -MT transfer.lo -MD -MP -MF .deps/transfer.Tpo -c transfer.c -o transfer.o >/dev/null 2>&1
if /bin/sh ../libtool --tag=CC --mode=compile i686-pc-linux-gnu-gcc -DHAVE_CONFIG_H  -I../include -I../lib -I../lib  -I/usr/include/openssl -I/usr/include  -march=pentium4 -O2 -pipe -fomit-frame-pointer -mfpmath=sse -funroll-loops -finline-functions -MT strtok.lo -MD -MP -MF ".deps/strtok.Tpo" -c -o strtok.lo strtok.c; \
        then mv -f ".deps/strtok.Tpo" ".deps/strtok.Plo"; else rm -f ".deps/strtok.Tpo"; exit 1; fi
 i686-pc-linux-gnu-gcc -DHAVE_CONFIG_H -I../include -I../lib -I../lib -I/usr/include/openssl -I/usr/include -march=pentium4 -O2 -pipe -fomit-frame-pointer -mfpmath=sse -funroll-loops -finline-functions -MT memdebug.lo -MD -MP -MF .deps/memdebug.Tpo -c memdebug.c  -fPIC -DPIC -o .libs/memdebug.o
 i686-pc-linux-gnu-gcc -DHAVE_CONFIG_H -I../include -I../lib -I../lib -I/usr/include/openssl -I/usr/include -march=pentium4 -O2 -pipe -fomit-frame-pointer -mfpmath=sse -funroll-loops -finline-functions -MT memdebug.lo -MD -MP -MF .deps/memdebug.Tpo -c memdebug.c -o memdebug.o >/dev/null 2>&1
 i686-pc-linux-gnu-gcc -DHAVE_CONFIG_H -I../include -I../lib -I../lib -I/usr/include/openssl -I/usr/include -march=pentium4 -O2 -pipe -fomit-frame-pointer -mfpmath=sse -funroll-loops -finline-functions -MT http_chunks.lo -MD -MP -MF .deps/http_chunks.Tpo -c http_chunks.c  -fPIC -DPIC -o .libs/http_chunks.o
if /bin/sh ../libtool --tag=CC --mode=compile i686-pc-linux-gnu-gcc -DHAVE_CONFIG_H  -I../include -I../lib -I../lib  -I/usr/include/openssl -I/usr/include  -march=pentium4 -O2 -pipe -fomit-frame-pointer -mfpmath=sse -funroll-loops -finline-functions -MT connect.lo -MD -MP -MF ".deps/connect.Tpo" -c -o connect.lo connect.c; \
        then mv -f ".deps/connect.Tpo" ".deps/connect.Plo"; else rm -f ".deps/connect.Tpo"; exit 1; fi
 i686-pc-linux-gnu-gcc -DHAVE_CONFIG_H -I../include -I../lib -I../lib -I/usr/include/openssl -I/usr/include -march=pentium4 -O2 -pipe -fomit-frame-pointer -mfpmath=sse -funroll-loops -finline-functions -MT http_chunks.lo -MD -MP -MF .deps/http_chunks.Tpo -c http_chunks.c -o http_chunks.o >/dev/null 2>&1
 i686-pc-linux-gnu-gcc -DHAVE_CONFIG_H -I../include -I../lib -I../lib -I/usr/include/openssl -I/usr/include -march=pentium4 -O2 -pipe -fomit-frame-pointer -mfpmath=sse -funroll-loops -finline-functions -MT strtok.lo -MD -MP -MF .deps/strtok.Tpo -c strtok.c  -fPIC -DPIC -o .libs/strtok.o
if /bin/sh ../libtool --tag=CC --mode=compile i686-pc-linux-gnu-gcc -DHAVE_CONFIG_H  -I../include -I../lib -I../lib  -I/usr/include/openssl -I/usr/include  -march=pentium4 -O2 -pipe -fomit-frame-pointer -mfpmath=sse -funroll-loops -finline-functions -MT llist.lo -MD -MP -MF ".deps/llist.Tpo" -c -o llist.lo llist.c; \
        then mv -f ".deps/llist.Tpo" ".deps/llist.Plo"; else rm -f ".deps/llist.Tpo"; exit 1; fi
if /bin/sh ../libtool --tag=CC --mode=compile i686-pc-linux-gnu-gcc -DHAVE_CONFIG_H  -I../include -I../lib -I../lib  -I/usr/include/openssl -I/usr/include  -march=pentium4 -O2 -pipe -fomit-frame-pointer -mfpmath=sse -funroll-loops -finline-functions -MT hash.lo -MD -MP -MF ".deps/hash.Tpo" -c -o hash.lo hash.c; \
        then mv -f ".deps/hash.Tpo" ".deps/hash.Plo"; else rm -f ".deps/hash.Tpo"; exit 1; fi
 i686-pc-linux-gnu-gcc -DHAVE_CONFIG_H -I../include -I../lib -I../lib -I/usr/include/openssl -I/usr/include -march=pentium4 -O2 -pipe -fomit-frame-pointer -mfpmath=sse -funroll-loops -finline-functions -MT strtok.lo -MD -MP -MF .deps/strtok.Tpo -c strtok.c -o strtok.o >/dev/null 2>&1
if /bin/sh ../libtool --tag=CC --mode=compile i686-pc-linux-gnu-gcc -DHAVE_CONFIG_H  -I../include -I../lib -I../lib  -I/usr/include/openssl -I/usr/include  -march=pentium4 -O2 -pipe -fomit-frame-pointer -mfpmath=sse -funroll-loops -finline-functions -MT multi.lo -MD -MP -MF ".deps/multi.Tpo" -c -o multi.lo multi.c; \
        then mv -f ".deps/multi.Tpo" ".deps/multi.Plo"; else rm -f ".deps/multi.Tpo"; exit 1; fi
 i686-pc-linux-gnu-gcc -DHAVE_CONFIG_H -I../include -I../lib -I../lib -I/usr/include/openssl -I/usr/include -march=pentium4 -O2 -pipe -fomit-frame-pointer -mfpmath=sse -funroll-loops -finline-functions -MT connect.lo -MD -MP -MF .deps/connect.Tpo -c connect.c  -fPIC -DPIC -o .libs/connect.o
 i686-pc-linux-gnu-gcc -DHAVE_CONFIG_H -I../include -I../lib -I../lib -I/usr/include/openssl -I/usr/include -march=pentium4 -O2 -pipe -fomit-frame-pointer -mfpmath=sse -funroll-loops -finline-functions -MT llist.lo -MD -MP -MF .deps/llist.Tpo -c llist.c  -fPIC -DPIC -o .libs/llist.o
 i686-pc-linux-gnu-gcc -DHAVE_CONFIG_H -I../include -I../lib -I../lib -I/usr/include/openssl -I/usr/include -march=pentium4 -O2 -pipe -fomit-frame-pointer -mfpmath=sse -funroll-loops -finline-functions -MT llist.lo -MD -MP -MF .deps/llist.Tpo -c llist.c -o llist.o >/dev/null 2>&1
 i686-pc-linux-gnu-gcc -DHAVE_CONFIG_H -I../include -I../lib -I../lib -I/usr/include/openssl -I/usr/include -march=pentium4 -O2 -pipe -fomit-frame-pointer -mfpmath=sse -funroll-loops -finline-functions -MT multi.lo -MD -MP -MF .deps/multi.Tpo -c multi.c  -fPIC -DPIC -o .libs/multi.o
 i686-pc-linux-gnu-gcc -DHAVE_CONFIG_H -I../include -I../lib -I../lib -I/usr/include/openssl -I/usr/include -march=pentium4 -O2 -pipe -fomit-frame-pointer -mfpmath=sse -funroll-loops -finline-functions -MT connect.lo -MD -MP -MF .deps/connect.Tpo -c connect.c -o connect.o >/dev/null 2>&1
if /bin/sh ../libtool --tag=CC --mode=compile i686-pc-linux-gnu-gcc -DHAVE_CONFIG_H  -I../include -I../lib -I../lib  -I/usr/include/openssl -I/usr/include  -march=pentium4 -O2 -pipe -fomit-frame-pointer -mfpmath=sse -funroll-loops -finline-functions -MT content_encoding.lo -MD -MP -MF ".deps/content_encoding.Tpo" -c -o content_encoding.lo content_encoding.c; \
        then mv -f ".deps/content_encoding.Tpo" ".deps/content_encoding.Plo"; else rm -f ".deps/content_encoding.Tpo"; exit 1; fi
 i686-pc-linux-gnu-gcc -DHAVE_CONFIG_H -I../include -I../lib -I../lib -I/usr/include/openssl -I/usr/include -march=pentium4 -O2 -pipe -fomit-frame-pointer -mfpmath=sse -funroll-loops -finline-functions -MT hash.lo -MD -MP -MF .deps/hash.Tpo -c hash.c  -fPIC -DPIC -o .libs/hash.o
 i686-pc-linux-gnu-gcc -DHAVE_CONFIG_H -I../include -I../lib -I../lib -I/usr/include/openssl -I/usr/include -march=pentium4 -O2 -pipe -fomit-frame-pointer -mfpmath=sse -funroll-loops -finline-functions -MT multi.lo -MD -MP -MF .deps/multi.Tpo -c multi.c -o multi.o >/dev/null 2>&1
if /bin/sh ../libtool --tag=CC --mode=compile i686-pc-linux-gnu-gcc -DHAVE_CONFIG_H  -I../include -I../lib -I../lib  -I/usr/include/openssl -I/usr/include  -march=pentium4 -O2 -pipe -fomit-frame-pointer -mfpmath=sse -funroll-loops -finline-functions -MT share.lo -MD -MP -MF ".deps/share.Tpo" -c -o share.lo share.c; \
        then mv -f ".deps/share.Tpo" ".deps/share.Plo"; else rm -f ".deps/share.Tpo"; exit 1; fi
 i686-pc-linux-gnu-gcc -DHAVE_CONFIG_H -I../include -I../lib -I../lib -I/usr/include/openssl -I/usr/include -march=pentium4 -O2 -pipe -fomit-frame-pointer -mfpmath=sse -funroll-loops -finline-functions -MT content_encoding.lo -MD -MP -MF .deps/content_encoding.Tpo -c content_encoding.c  -fPIC -DPIC -o .libs/content_encoding.o
 i686-pc-linux-gnu-gcc -DHAVE_CONFIG_H -I../include -I../lib -I../lib -I/usr/include/openssl -I/usr/include -march=pentium4 -O2 -pipe -fomit-frame-pointer -mfpmath=sse -funroll-loops -finline-functions -MT hash.lo -MD -MP -MF .deps/hash.Tpo -c hash.c -o hash.o >/dev/null 2>&1
if /bin/sh ../libtool --tag=CC --mode=compile i686-pc-linux-gnu-gcc -DHAVE_CONFIG_H  -I../include -I../lib -I../lib  -I/usr/include/openssl -I/usr/include  -march=pentium4 -O2 -pipe -fomit-frame-pointer -mfpmath=sse -funroll-loops -finline-functions -MT http_digest.lo -MD -MP -MF ".deps/http_digest.Tpo" -c -o http_digest.lo http_digest.c; \
        then mv -f ".deps/http_digest.Tpo" ".deps/http_digest.Plo"; else rm -f ".deps/http_digest.Tpo"; exit 1; fi
if /bin/sh ../libtool --tag=CC --mode=compile i686-pc-linux-gnu-gcc -DHAVE_CONFIG_H  -I../include -I../lib -I../lib  -I/usr/include/openssl -I/usr/include  -march=pentium4 -O2 -pipe -fomit-frame-pointer -mfpmath=sse -funroll-loops -finline-functions -MT md5.lo -MD -MP -MF ".deps/md5.Tpo" -c -o md5.lo md5.c; \
        then mv -f ".deps/md5.Tpo" ".deps/md5.Plo"; else rm -f ".deps/md5.Tpo"; exit 1; fi
 i686-pc-linux-gnu-gcc -DHAVE_CONFIG_H -I../include -I../lib -I../lib -I/usr/include/openssl -I/usr/include -march=pentium4 -O2 -pipe -fomit-frame-pointer -mfpmath=sse -funroll-loops -finline-functions -MT share.lo -MD -MP -MF .deps/share.Tpo -c share.c  -fPIC -DPIC -o .libs/share.o
 i686-pc-linux-gnu-gcc -DHAVE_CONFIG_H -I../include -I../lib -I../lib -I/usr/include/openssl -I/usr/include -march=pentium4 -O2 -pipe -fomit-frame-pointer -mfpmath=sse -funroll-loops -finline-functions -MT content_encoding.lo -MD -MP -MF .deps/content_encoding.Tpo -c content_encoding.c -o content_encoding.o >/dev/null 2>&1
 i686-pc-linux-gnu-gcc -DHAVE_CONFIG_H -I../include -I../lib -I../lib -I/usr/include/openssl -I/usr/include -march=pentium4 -O2 -pipe -fomit-frame-pointer -mfpmath=sse -funroll-loops -finline-functions -MT http_digest.lo -MD -MP -MF .deps/http_digest.Tpo -c http_digest.c  -fPIC -DPIC -o .libs/http_digest.o
if /bin/sh ../libtool --tag=CC --mode=compile i686-pc-linux-gnu-gcc -DHAVE_CONFIG_H  -I../include -I../lib -I../lib  -I/usr/include/openssl -I/usr/include  -march=pentium4 -O2 -pipe -fomit-frame-pointer -mfpmath=sse -funroll-loops -finline-functions -MT http_negotiate.lo -MD -MP -MF ".deps/http_negotiate.Tpo" -c -o http_negotiate.lo http_negotiate.c; \
        then mv -f ".deps/http_negotiate.Tpo" ".deps/http_negotiate.Plo"; else rm -f ".deps/http_negotiate.Tpo"; exit 1; fi
 i686-pc-linux-gnu-gcc -DHAVE_CONFIG_H -I../include -I../lib -I../lib -I/usr/include/openssl -I/usr/include -march=pentium4 -O2 -pipe -fomit-frame-pointer -mfpmath=sse -funroll-loops -finline-functions -MT share.lo -MD -MP -MF .deps/share.Tpo -c share.c -o share.o >/dev/null 2>&1
if /bin/sh ../libtool --tag=CC --mode=compile i686-pc-linux-gnu-gcc -DHAVE_CONFIG_H  -I../include -I../lib -I../lib  -I/usr/include/openssl -I/usr/include  -march=pentium4 -O2 -pipe -fomit-frame-pointer -mfpmath=sse -funroll-loops -finline-functions -MT http_ntlm.lo -MD -MP -MF ".deps/http_ntlm.Tpo" -c -o http_ntlm.lo http_ntlm.c; \
        then mv -f ".deps/http_ntlm.Tpo" ".deps/http_ntlm.Plo"; else rm -f ".deps/http_ntlm.Tpo"; exit 1; fi
 i686-pc-linux-gnu-gcc -DHAVE_CONFIG_H -I../include -I../lib -I../lib -I/usr/include/openssl -I/usr/include -march=pentium4 -O2 -pipe -fomit-frame-pointer -mfpmath=sse -funroll-loops -finline-functions -MT md5.lo -MD -MP -MF .deps/md5.Tpo -c md5.c  -fPIC -DPIC -o .libs/md5.o
 i686-pc-linux-gnu-gcc -DHAVE_CONFIG_H -I../include -I../lib -I../lib -I/usr/include/openssl -I/usr/include -march=pentium4 -O2 -pipe -fomit-frame-pointer -mfpmath=sse -funroll-loops -finline-functions -MT http_digest.lo -MD -MP -MF .deps/http_digest.Tpo -c http_digest.c -o http_digest.o >/dev/null 2>&1
 i686-pc-linux-gnu-gcc -DHAVE_CONFIG_H -I../include -I../lib -I../lib -I/usr/include/openssl -I/usr/include -march=pentium4 -O2 -pipe -fomit-frame-pointer -mfpmath=sse -funroll-loops -finline-functions -MT md5.lo -MD -MP -MF .deps/md5.Tpo -c md5.c -o md5.o >/dev/null 2>&1
if /bin/sh ../libtool --tag=CC --mode=compile i686-pc-linux-gnu-gcc -DHAVE_CONFIG_H  -I../include -I../lib -I../lib  -I/usr/include/openssl -I/usr/include  -march=pentium4 -O2 -pipe -fomit-frame-pointer -mfpmath=sse -funroll-loops -finline-functions -MT inet_pton.lo -MD -MP -MF ".deps/inet_pton.Tpo" -c -o inet_pton.lo inet_pton.c; \
        then mv -f ".deps/inet_pton.Tpo" ".deps/inet_pton.Plo"; else rm -f ".deps/inet_pton.Tpo"; exit 1; fi
 i686-pc-linux-gnu-gcc -DHAVE_CONFIG_H -I../include -I../lib -I../lib -I/usr/include/openssl -I/usr/include -march=pentium4 -O2 -pipe -fomit-frame-pointer -mfpmath=sse -funroll-loops -finline-functions -MT http_negotiate.lo -MD -MP -MF .deps/http_negotiate.Tpo -c http_negotiate.c  -fPIC -DPIC -o .libs/http_negotiate.o
 i686-pc-linux-gnu-gcc -DHAVE_CONFIG_H -I../include -I../lib -I../lib -I/usr/include/openssl -I/usr/include -march=pentium4 -O2 -pipe -fomit-frame-pointer -mfpmath=sse -funroll-loops -finline-functions -MT http_ntlm.lo -MD -MP -MF .deps/http_ntlm.Tpo -c http_ntlm.c  -fPIC -DPIC -o .libs/http_ntlm.o
 i686-pc-linux-gnu-gcc -DHAVE_CONFIG_H -I../include -I../lib -I../lib -I/usr/include/openssl -I/usr/include -march=pentium4 -O2 -pipe -fomit-frame-pointer -mfpmath=sse -funroll-loops -finline-functions -MT http_negotiate.lo -MD -MP -MF .deps/http_negotiate.Tpo -c http_negotiate.c -o http_negotiate.o >/dev/null 2>&1
if /bin/sh ../libtool --tag=CC --mode=compile i686-pc-linux-gnu-gcc -DHAVE_CONFIG_H  -I../include -I../lib -I../lib  -I/usr/include/openssl -I/usr/include  -march=pentium4 -O2 -pipe -fomit-frame-pointer -mfpmath=sse -funroll-loops -finline-functions -MT strtoofft.lo -MD -MP -MF ".deps/strtoofft.Tpo" -c -o strtoofft.lo strtoofft.c; \
        then mv -f ".deps/strtoofft.Tpo" ".deps/strtoofft.Plo"; else rm -f ".deps/strtoofft.Tpo"; exit 1; fi
if /bin/sh ../libtool --tag=CC --mode=compile i686-pc-linux-gnu-gcc -DHAVE_CONFIG_H  -I../include -I../lib -I../lib  -I/usr/include/openssl -I/usr/include  -march=pentium4 -O2 -pipe -fomit-frame-pointer -mfpmath=sse -funroll-loops -finline-functions -MT strerror.lo -MD -MP -MF ".deps/strerror.Tpo" -c -o strerror.lo strerror.c; \
        then mv -f ".deps/strerror.Tpo" ".deps/strerror.Plo"; else rm -f ".deps/strerror.Tpo"; exit 1; fi
 i686-pc-linux-gnu-gcc -DHAVE_CONFIG_H -I../include -I../lib -I../lib -I/usr/include/openssl -I/usr/include -march=pentium4 -O2 -pipe -fomit-frame-pointer -mfpmath=sse -funroll-loops -finline-functions -MT inet_pton.lo -MD -MP -MF .deps/inet_pton.Tpo -c inet_pton.c  -fPIC -DPIC -o .libs/inet_pton.o
 i686-pc-linux-gnu-gcc -DHAVE_CONFIG_H -I../include -I../lib -I../lib -I/usr/include/openssl -I/usr/include -march=pentium4 -O2 -pipe -fomit-frame-pointer -mfpmath=sse -funroll-loops -finline-functions -MT inet_pton.lo -MD -MP -MF .deps/inet_pton.Tpo -c inet_pton.c -o inet_pton.o >/dev/null 2>&1
 i686-pc-linux-gnu-gcc -DHAVE_CONFIG_H -I../include -I../lib -I../lib -I/usr/include/openssl -I/usr/include -march=pentium4 -O2 -pipe -fomit-frame-pointer -mfpmath=sse -funroll-loops -finline-functions -MT http_ntlm.lo -MD -MP -MF .deps/http_ntlm.Tpo -c http_ntlm.c -o http_ntlm.o >/dev/null 2>&1
if /bin/sh ../libtool --tag=CC --mode=compile i686-pc-linux-gnu-gcc -DHAVE_CONFIG_H  -I../include -I../lib -I../lib  -I/usr/include/openssl -I/usr/include  -march=pentium4 -O2 -pipe -fomit-frame-pointer -mfpmath=sse -funroll-loops -finline-functions -MT hostares.lo -MD -MP -MF ".deps/hostares.Tpo" -c -o hostares.lo hostares.c; \
        then mv -f ".deps/hostares.Tpo" ".deps/hostares.Plo"; else rm -f ".deps/hostares.Tpo"; exit 1; fi
 i686-pc-linux-gnu-gcc -DHAVE_CONFIG_H -I../include -I../lib -I../lib -I/usr/include/openssl -I/usr/include -march=pentium4 -O2 -pipe -fomit-frame-pointer -mfpmath=sse -funroll-loops -finline-functions -MT hostares.lo -MD -MP -MF .deps/hostares.Tpo -c hostares.c  -fPIC -DPIC -o .libs/hostares.o
 i686-pc-linux-gnu-gcc -DHAVE_CONFIG_H -I../include -I../lib -I../lib -I/usr/include/openssl -I/usr/include -march=pentium4 -O2 -pipe -fomit-frame-pointer -mfpmath=sse -funroll-loops -finline-functions -MT strtoofft.lo -MD -MP -MF .deps/strtoofft.Tpo -c strtoofft.c  -fPIC -DPIC -o .libs/strtoofft.o
if /bin/sh ../libtool --tag=CC --mode=compile i686-pc-linux-gnu-gcc -DHAVE_CONFIG_H  -I../include -I../lib -I../lib  -I/usr/include/openssl -I/usr/include  -march=pentium4 -O2 -pipe -fomit-frame-pointer -mfpmath=sse -funroll-loops -finline-functions -MT hostasyn.lo -MD -MP -MF ".deps/hostasyn.Tpo" -c -o hostasyn.lo hostasyn.c; \
        then mv -f ".deps/hostasyn.Tpo" ".deps/hostasyn.Plo"; else rm -f ".deps/hostasyn.Tpo"; exit 1; fi
 i686-pc-linux-gnu-gcc -DHAVE_CONFIG_H -I../include -I../lib -I../lib -I/usr/include/openssl -I/usr/include -march=pentium4 -O2 -pipe -fomit-frame-pointer -mfpmath=sse -funroll-loops -finline-functions -MT strtoofft.lo -MD -MP -MF .deps/strtoofft.Tpo -c strtoofft.c -o strtoofft.o >/dev/null 2>&1
 i686-pc-linux-gnu-gcc -DHAVE_CONFIG_H -I../include -I../lib -I../lib -I/usr/include/openssl -I/usr/include -march=pentium4 -O2 -pipe -fomit-frame-pointer -mfpmath=sse -funroll-loops -finline-functions -MT strerror.lo -MD -MP -MF .deps/strerror.Tpo -c strerror.c  -fPIC -DPIC -o .libs/strerror.o
if /bin/sh ../libtool --tag=CC --mode=compile i686-pc-linux-gnu-gcc -DHAVE_CONFIG_H  -I../include -I../lib -I../lib  -I/usr/include/openssl -I/usr/include  -march=pentium4 -O2 -pipe -fomit-frame-pointer -mfpmath=sse -funroll-loops -finline-functions -MT hostip4.lo -MD -MP -MF ".deps/hostip4.Tpo" -c -o hostip4.lo hostip4.c; \
        then mv -f ".deps/hostip4.Tpo" ".deps/hostip4.Plo"; else rm -f ".deps/hostip4.Tpo"; exit 1; fi
 i686-pc-linux-gnu-gcc -DHAVE_CONFIG_H -I../include -I../lib -I../lib -I/usr/include/openssl -I/usr/include -march=pentium4 -O2 -pipe -fomit-frame-pointer -mfpmath=sse -funroll-loops -finline-functions -MT hostares.lo -MD -MP -MF .deps/hostares.Tpo -c hostares.c -o hostares.o >/dev/null 2>&1
 i686-pc-linux-gnu-gcc -DHAVE_CONFIG_H -I../include -I../lib -I../lib -I/usr/include/openssl -I/usr/include -march=pentium4 -O2 -pipe -fomit-frame-pointer -mfpmath=sse -funroll-loops -finline-functions -MT strerror.lo -MD -MP -MF .deps/strerror.Tpo -c strerror.c -o strerror.o >/dev/null 2>&1
if /bin/sh ../libtool --tag=CC --mode=compile i686-pc-linux-gnu-gcc -DHAVE_CONFIG_H  -I../include -I../lib -I../lib  -I/usr/include/openssl -I/usr/include  -march=pentium4 -O2 -pipe -fomit-frame-pointer -mfpmath=sse -funroll-loops -finline-functions -MT hostip6.lo -MD -MP -MF ".deps/hostip6.Tpo" -c -o hostip6.lo hostip6.c; \
        then mv -f ".deps/hostip6.Tpo" ".deps/hostip6.Plo"; else rm -f ".deps/hostip6.Tpo"; exit 1; fi
 i686-pc-linux-gnu-gcc -DHAVE_CONFIG_H -I../include -I../lib -I../lib -I/usr/include/openssl -I/usr/include -march=pentium4 -O2 -pipe -fomit-frame-pointer -mfpmath=sse -funroll-loops -finline-functions -MT hostip4.lo -MD -MP -MF .deps/hostip4.Tpo -c hostip4.c  -fPIC -DPIC -o .libs/hostip4.o
 i686-pc-linux-gnu-gcc -DHAVE_CONFIG_H -I../include -I../lib -I../lib -I/usr/include/openssl -I/usr/include -march=pentium4 -O2 -pipe -fomit-frame-pointer -mfpmath=sse -funroll-loops -finline-functions -MT hostasyn.lo -MD -MP -MF .deps/hostasyn.Tpo -c hostasyn.c  -fPIC -DPIC -o .libs/hostasyn.o
if /bin/sh ../libtool --tag=CC --mode=compile i686-pc-linux-gnu-gcc -DHAVE_CONFIG_H  -I../include -I../lib -I../lib  -I/usr/include/openssl -I/usr/include  -march=pentium4 -O2 -pipe -fomit-frame-pointer -mfpmath=sse -funroll-loops -finline-functions -MT hostsyn.lo -MD -MP -MF ".deps/hostsyn.Tpo" -c -o hostsyn.lo hostsyn.c; \
        then mv -f ".deps/hostsyn.Tpo" ".deps/hostsyn.Plo"; else rm -f ".deps/hostsyn.Tpo"; exit 1; fi
 i686-pc-linux-gnu-gcc -DHAVE_CONFIG_H -I../include -I../lib -I../lib -I/usr/include/openssl -I/usr/include -march=pentium4 -O2 -pipe -fomit-frame-pointer -mfpmath=sse -funroll-loops -finline-functions -MT hostip4.lo -MD -MP -MF .deps/hostip4.Tpo -c hostip4.c -o hostip4.o >/dev/null 2>&1
 i686-pc-linux-gnu-gcc -DHAVE_CONFIG_H -I../include -I../lib -I../lib -I/usr/include/openssl -I/usr/include -march=pentium4 -O2 -pipe -fomit-frame-pointer -mfpmath=sse -funroll-loops -finline-functions -MT hostasyn.lo -MD -MP -MF .deps/hostasyn.Tpo -c hostasyn.c -o hostasyn.o >/dev/null 2>&1
 i686-pc-linux-gnu-gcc -DHAVE_CONFIG_H -I../include -I../lib -I../lib -I/usr/include/openssl -I/usr/include -march=pentium4 -O2 -pipe -fomit-frame-pointer -mfpmath=sse -funroll-loops -finline-functions -MT hostip6.lo -MD -MP -MF .deps/hostip6.Tpo -c hostip6.c  -fPIC -DPIC -o .libs/hostip6.o
if /bin/sh ../libtool --tag=CC --mode=compile i686-pc-linux-gnu-gcc -DHAVE_CONFIG_H  -I../include -I../lib -I../lib  -I/usr/include/openssl -I/usr/include  -march=pentium4 -O2 -pipe -fomit-frame-pointer -mfpmath=sse -funroll-loops -finline-functions -MT hostthre.lo -MD -MP -MF ".deps/hostthre.Tpo" -c -o hostthre.lo hostthre.c; \
        then mv -f ".deps/hostthre.Tpo" ".deps/hostthre.Plo"; else rm -f ".deps/hostthre.Tpo"; exit 1; fi
 i686-pc-linux-gnu-gcc -DHAVE_CONFIG_H -I../include -I../lib -I../lib -I/usr/include/openssl -I/usr/include -march=pentium4 -O2 -pipe -fomit-frame-pointer -mfpmath=sse -funroll-loops -finline-functions -MT hostsyn.lo -MD -MP -MF .deps/hostsyn.Tpo -c hostsyn.c  -fPIC -DPIC -o .libs/hostsyn.o
if /bin/sh ../libtool --tag=CC --mode=compile i686-pc-linux-gnu-gcc -DHAVE_CONFIG_H  -I../include -I../lib -I../lib  -I/usr/include/openssl -I/usr/include  -march=pentium4 -O2 -pipe -fomit-frame-pointer -mfpmath=sse -funroll-loops -finline-functions -MT inet_ntop.lo -MD -MP -MF ".deps/inet_ntop.Tpo" -c -o inet_ntop.lo inet_ntop.c; \
        then mv -f ".deps/inet_ntop.Tpo" ".deps/inet_ntop.Plo"; else rm -f ".deps/inet_ntop.Tpo"; exit 1; fi
 i686-pc-linux-gnu-gcc -DHAVE_CONFIG_H -I../include -I../lib -I../lib -I/usr/include/openssl -I/usr/include -march=pentium4 -O2 -pipe -fomit-frame-pointer -mfpmath=sse -funroll-loops -finline-functions -MT hostip6.lo -MD -MP -MF .deps/hostip6.Tpo -c hostip6.c -o hostip6.o >/dev/null 2>&1
 i686-pc-linux-gnu-gcc -DHAVE_CONFIG_H -I../include -I../lib -I../lib -I/usr/include/openssl -I/usr/include -march=pentium4 -O2 -pipe -fomit-frame-pointer -mfpmath=sse -funroll-loops -finline-functions -MT hostsyn.lo -MD -MP -MF .deps/hostsyn.Tpo -c hostsyn.c -o hostsyn.o >/dev/null 2>&1
if /bin/sh ../libtool --tag=CC --mode=compile i686-pc-linux-gnu-gcc -DHAVE_CONFIG_H  -I../include -I../lib -I../lib  -I/usr/include/openssl -I/usr/include  -march=pentium4 -O2 -pipe -fomit-frame-pointer -mfpmath=sse -funroll-loops -finline-functions -MT parsedate.lo -MD -MP -MF ".deps/parsedate.Tpo" -c -o parsedate.lo parsedate.c; \
        then mv -f ".deps/parsedate.Tpo" ".deps/parsedate.Plo"; else rm -f ".deps/parsedate.Tpo"; exit 1; fi
 i686-pc-linux-gnu-gcc -DHAVE_CONFIG_H -I../include -I../lib -I../lib -I/usr/include/openssl -I/usr/include -march=pentium4 -O2 -pipe -fomit-frame-pointer -mfpmath=sse -funroll-loops -finline-functions -MT hostthre.lo -MD -MP -MF .deps/hostthre.Tpo -c hostthre.c  -fPIC -DPIC -o .libs/hostthre.o
if /bin/sh ../libtool --tag=CC --mode=compile i686-pc-linux-gnu-gcc -DHAVE_CONFIG_H  -I../include -I../lib -I../lib  -I/usr/include/openssl -I/usr/include  -march=pentium4 -O2 -pipe -fomit-frame-pointer -mfpmath=sse -funroll-loops -finline-functions -MT select.lo -MD -MP -MF ".deps/select.Tpo" -c -o select.lo select.c; \
        then mv -f ".deps/select.Tpo" ".deps/select.Plo"; else rm -f ".deps/select.Tpo"; exit 1; fi
 i686-pc-linux-gnu-gcc -DHAVE_CONFIG_H -I../include -I../lib -I../lib -I/usr/include/openssl -I/usr/include -march=pentium4 -O2 -pipe -fomit-frame-pointer -mfpmath=sse -funroll-loops -finline-functions -MT hostthre.lo -MD -MP -MF .deps/hostthre.Tpo -c hostthre.c -o hostthre.o >/dev/null 2>&1
 i686-pc-linux-gnu-gcc -DHAVE_CONFIG_H -I../include -I../lib -I../lib -I/usr/include/openssl -I/usr/include -march=pentium4 -O2 -pipe -fomit-frame-pointer -mfpmath=sse -funroll-loops -finline-functions -MT parsedate.lo -MD -MP -MF .deps/parsedate.Tpo -c parsedate.c  -fPIC -DPIC -o .libs/parsedate.o
if /bin/sh ../libtool --tag=CC --mode=compile i686-pc-linux-gnu-gcc -DHAVE_CONFIG_H  -I../include -I../lib -I../lib  -I/usr/include/openssl -I/usr/include  -march=pentium4 -O2 -pipe -fomit-frame-pointer -mfpmath=sse -funroll-loops -finline-functions -MT gtls.lo -MD -MP -MF ".deps/gtls.Tpo" -c -o gtls.lo gtls.c; \
        then mv -f ".deps/gtls.Tpo" ".deps/gtls.Plo"; else rm -f ".deps/gtls.Tpo"; exit 1; fi
 i686-pc-linux-gnu-gcc -DHAVE_CONFIG_H -I../include -I../lib -I../lib -I/usr/include/openssl -I/usr/include -march=pentium4 -O2 -pipe -fomit-frame-pointer -mfpmath=sse -funroll-loops -finline-functions -MT inet_ntop.lo -MD -MP -MF .deps/inet_ntop.Tpo -c inet_ntop.c  -fPIC -DPIC -o .libs/inet_ntop.o
 i686-pc-linux-gnu-gcc -DHAVE_CONFIG_H -I../include -I../lib -I../lib -I/usr/include/openssl -I/usr/include -march=pentium4 -O2 -pipe -fomit-frame-pointer -mfpmath=sse -funroll-loops -finline-functions -MT parsedate.lo -MD -MP -MF .deps/parsedate.Tpo -c parsedate.c -o parsedate.o >/dev/null 2>&1
 i686-pc-linux-gnu-gcc -DHAVE_CONFIG_H -I../include -I../lib -I../lib -I/usr/include/openssl -I/usr/include -march=pentium4 -O2 -pipe -fomit-frame-pointer -mfpmath=sse -funroll-loops -finline-functions -MT inet_ntop.lo -MD -MP -MF .deps/inet_ntop.Tpo -c inet_ntop.c -o inet_ntop.o >/dev/null 2>&1
if /bin/sh ../libtool --tag=CC --mode=compile i686-pc-linux-gnu-gcc -DHAVE_CONFIG_H  -I../include -I../lib -I../lib  -I/usr/include/openssl -I/usr/include  -march=pentium4 -O2 -pipe -fomit-frame-pointer -mfpmath=sse -funroll-loops -finline-functions -MT sslgen.lo -MD -MP -MF ".deps/sslgen.Tpo" -c -o sslgen.lo sslgen.c; \
        then mv -f ".deps/sslgen.Tpo" ".deps/sslgen.Plo"; else rm -f ".deps/sslgen.Tpo"; exit 1; fi
if /bin/sh ../libtool --tag=CC --mode=compile i686-pc-linux-gnu-gcc -DHAVE_CONFIG_H  -I../include -I../lib -I../lib  -I/usr/include/openssl -I/usr/include  -march=pentium4 -O2 -pipe -fomit-frame-pointer -mfpmath=sse -funroll-loops -finline-functions -MT tftp.lo -MD -MP -MF ".deps/tftp.Tpo" -c -o tftp.lo tftp.c; \
        then mv -f ".deps/tftp.Tpo" ".deps/tftp.Plo"; else rm -f ".deps/tftp.Tpo"; exit 1; fi
 i686-pc-linux-gnu-gcc -DHAVE_CONFIG_H -I../include -I../lib -I../lib -I/usr/include/openssl -I/usr/include -march=pentium4 -O2 -pipe -fomit-frame-pointer -mfpmath=sse -funroll-loops -finline-functions -MT select.lo -MD -MP -MF .deps/select.Tpo -c select.c  -fPIC -DPIC -o .libs/select.o
 i686-pc-linux-gnu-gcc -DHAVE_CONFIG_H -I../include -I../lib -I../lib -I/usr/include/openssl -I/usr/include -march=pentium4 -O2 -pipe -fomit-frame-pointer -mfpmath=sse -funroll-loops -finline-functions -MT gtls.lo -MD -MP -MF .deps/gtls.Tpo -c gtls.c  -fPIC -DPIC -o .libs/gtls.o
 i686-pc-linux-gnu-gcc -DHAVE_CONFIG_H -I../include -I../lib -I../lib -I/usr/include/openssl -I/usr/include -march=pentium4 -O2 -pipe -fomit-frame-pointer -mfpmath=sse -funroll-loops -finline-functions -MT gtls.lo -MD -MP -MF .deps/gtls.Tpo -c gtls.c -o gtls.o >/dev/null 2>&1
 i686-pc-linux-gnu-gcc -DHAVE_CONFIG_H -I../include -I../lib -I../lib -I/usr/include/openssl -I/usr/include -march=pentium4 -O2 -pipe -fomit-frame-pointer -mfpmath=sse -funroll-loops -finline-functions -MT select.lo -MD -MP -MF .deps/select.Tpo -c select.c -o select.o >/dev/null 2>&1
 i686-pc-linux-gnu-gcc -DHAVE_CONFIG_H -I../include -I../lib -I../lib -I/usr/include/openssl -I/usr/include -march=pentium4 -O2 -pipe -fomit-frame-pointer -mfpmath=sse -funroll-loops -finline-functions -MT tftp.lo -MD -MP -MF .deps/tftp.Tpo -c tftp.c  -fPIC -DPIC -o .libs/tftp.o
 i686-pc-linux-gnu-gcc -DHAVE_CONFIG_H -I../include -I../lib -I../lib -I/usr/include/openssl -I/usr/include -march=pentium4 -O2 -pipe -fomit-frame-pointer -mfpmath=sse -funroll-loops -finline-functions -MT sslgen.lo -MD -MP -MF .deps/sslgen.Tpo -c sslgen.c  -fPIC -DPIC -o .libs/sslgen.o
 i686-pc-linux-gnu-gcc -DHAVE_CONFIG_H -I../include -I../lib -I../lib -I/usr/include/openssl -I/usr/include -march=pentium4 -O2 -pipe -fomit-frame-pointer -mfpmath=sse -funroll-loops -finline-functions -MT tftp.lo -MD -MP -MF .deps/tftp.Tpo -c tftp.c -o tftp.o >/dev/null 2>&1
 i686-pc-linux-gnu-gcc -DHAVE_CONFIG_H -I../include -I../lib -I../lib -I/usr/include/openssl -I/usr/include -march=pentium4 -O2 -pipe -fomit-frame-pointer -mfpmath=sse -funroll-loops -finline-functions -MT sslgen.lo -MD -MP -MF .deps/sslgen.Tpo -c sslgen.c -o sslgen.o >/dev/null 2>&1
/bin/sh ../libtool --tag=CC --mode=link i686-pc-linux-gnu-gcc  -march=pentium4 -O2 -pipe -fomit-frame-pointer -mfpmath=sse -funroll-loops -finline-functions  -Wl,-O1 -Wl,--enable-new-dtags -Wl,--sort-common -s -L/usr/lib -o libcurl.la -rpath /usr/lib  -version-info 3:0:0  file.lo timeval.lo base64.lo hostip.lo progress.lo formdata.lo cookie.lo http.lo sendf.lo ftp.lo url.lo dict.lo if2ip.lo speedcheck.lo ldap.lo ssluse.lo version.lo getenv.lo escape.lo mprintf.lo telnet.lo netrc.lo getinfo.lo transfer.lo strequal.lo easy.lo security.lo krb4.lo memdebug.lo http_chunks.lo strtok.lo connect.lo llist.lo hash.lo multi.lo content_encoding.lo share.lo http_digest.lo md5.lo http_negotiate.lo http_ntlm.lo inet_pton.lo strtoofft.lo strerror.lo hostares.lo hostasyn.lo hostip4.lo hostip6.lo hostsyn.lo hostthre.lo inet_ntop.lo parsedate.lo select.lo gtls.lo sslgen.lo tftp.lo   -lssl -lcrypto -ldl  -lz
i686-pc-linux-gnu-gcc -shared  .libs/file.o .libs/timeval.o .libs/base64.o .libs/hostip.o .libs/progress.o .libs/formdata.o .libs/cookie.o .libs/http.o .libs/sendf.o .libs/ftp.o .libs/url.o .libs/dict.o .libs/if2ip.o .libs/speedcheck.o .libs/ldap.o .libs/ssluse.o .libs/version.o .libs/getenv.o .libs/escape.o .libs/mprintf.o .libs/telnet.o .libs/netrc.o .libs/getinfo.o .libs/transfer.o .libs/strequal.o .libs/easy.o .libs/security.o .libs/krb4.o .libs/memdebug.o .libs/http_chunks.o .libs/strtok.o .libs/connect.o .libs/llist.o .libs/hash.o .libs/multi.o .libs/content_encoding.o .libs/share.o .libs/http_digest.o .libs/md5.o .libs/http_negotiate.o .libs/http_ntlm.o .libs/inet_pton.o .libs/strtoofft.o .libs/strerror.o .libs/hostares.o .libs/hostasyn.o .libs/hostip4.o .libs/hostip6.o .libs/hostsyn.o .libs/hostthre.o .libs/inet_ntop.o .libs/parsedate.o .libs/select.o .libs/gtls.o .libs/sslgen.o .libs/tftp.o  -L/usr/lib -lssl -lcrypto -ldl -lz  -march=pentium4 -mfpmath=sse -Wl,-O1 -Wl,--enable-new-dtags -Wl,--sort-common -Wl,-soname -Wl,libcurl.so.3 -o .libs/libcurl.so.3.0.0
(cd .libs && rm -f libcurl.so.3 && ln -s libcurl.so.3.0.0 libcurl.so.3)
(cd .libs && rm -f libcurl.so && ln -s libcurl.so.3.0.0 libcurl.so)
i686-pc-linux-gnu-ar cru .libs/libcurl.a  file.o timeval.o base64.o hostip.o progress.o formdata.o cookie.o http.o sendf.o ftp.o url.o dict.o if2ip.o speedcheck.o ldap.o ssluse.o version.o getenv.o escape.o mprintf.o telnet.o netrc.o getinfo.o transfer.o strequal.o easy.o security.o krb4.o memdebug.o http_chunks.o strtok.o connect.o llist.o hash.o multi.o content_encoding.o share.o http_digest.o md5.o http_negotiate.o http_ntlm.o inet_pton.o strtoofft.o strerror.o hostares.o hostasyn.o hostip4.o hostip6.o hostsyn.o hostthre.o inet_ntop.o parsedate.o select.o gtls.o sslgen.o tftp.o
i686-pc-linux-gnu-ranlib .libs/libcurl.a
creating libcurl.la
(cd .libs && rm -f libcurl.la && ln -s ../libcurl.la libcurl.la)
make[2]: quittant le répertoire « /mnt/Z/portage/portage/curl-7.15.1-r1/work/curl-7.15.1/lib »
make[1]: quittant le répertoire « /mnt/Z/portage/portage/curl-7.15.1-r1/work/curl-7.15.1/lib »
Making all in src
make[1]: entrant dans le répertoire « /mnt/Z/portage/portage/curl-7.15.1-r1/work/curl-7.15.1/src »
make  all-am
make[2]: entrant dans le répertoire « /mnt/Z/portage/portage/curl-7.15.1-r1/work/curl-7.15.1/src »
if i686-pc-linux-gnu-gcc -DHAVE_CONFIG_H  -I../src -I../include -I../src -I../lib  -I/usr/include/openssl -I/usr/include  -march=pentium4 -O2 -pipe -fomit-frame-pointer -mfpmath=sse -funroll-loops -finline-functions -MT main.o -MD -MP -MF ".deps/main.Tpo" -c -o main.o main.c; \
        then mv -f ".deps/main.Tpo" ".deps/main.Po"; else rm -f ".deps/main.Tpo"; exit 1; fi
if i686-pc-linux-gnu-gcc -DHAVE_CONFIG_H  -I../src -I../include -I../src -I../lib  -I/usr/include/openssl -I/usr/include  -march=pentium4 -O2 -pipe -fomit-frame-pointer -mfpmath=sse -funroll-loops -finline-functions -MT hugehelp.o -MD -MP -MF ".deps/hugehelp.Tpo" -c -o hugehelp.o hugehelp.c; \
        then mv -f ".deps/hugehelp.Tpo" ".deps/hugehelp.Po"; else rm -f ".deps/hugehelp.Tpo"; exit 1; fi
if i686-pc-linux-gnu-gcc -DHAVE_CONFIG_H  -I../src -I../include -I../src -I../lib  -I/usr/include/openssl -I/usr/include  -march=pentium4 -O2 -pipe -fomit-frame-pointer -mfpmath=sse -funroll-loops -finline-functions -MT urlglob.o -MD -MP -MF ".deps/urlglob.Tpo" -c -o urlglob.o urlglob.c; \
        then mv -f ".deps/urlglob.Tpo" ".deps/urlglob.Po"; else rm -f ".deps/urlglob.Tpo"; exit 1; fi
if i686-pc-linux-gnu-gcc -DHAVE_CONFIG_H  -I../src -I../include -I../src -I../lib  -I/usr/include/openssl -I/usr/include  -march=pentium4 -O2 -pipe -fomit-frame-pointer -mfpmath=sse -funroll-loops -finline-functions -MT writeout.o -MD -MP -MF ".deps/writeout.Tpo" -c -o writeout.o writeout.c; \
        then mv -f ".deps/writeout.Tpo" ".deps/writeout.Po"; else rm -f ".deps/writeout.Tpo"; exit 1; fi
if i686-pc-linux-gnu-gcc -DHAVE_CONFIG_H  -I../src -I../include -I../src -I../lib  -I/usr/include/openssl -I/usr/include  -march=pentium4 -O2 -pipe -fomit-frame-pointer -mfpmath=sse -funroll-loops -finline-functions -MT writeenv.o -MD -MP -MF ".deps/writeenv.Tpo" -c -o writeenv.o writeenv.c; \
        then mv -f ".deps/writeenv.Tpo" ".deps/writeenv.Po"; else rm -f ".deps/writeenv.Tpo"; exit 1; fi
if i686-pc-linux-gnu-gcc -DHAVE_CONFIG_H  -I../src -I../include -I../src -I../lib  -I/usr/include/openssl -I/usr/include  -march=pentium4 -O2 -pipe -fomit-frame-pointer -mfpmath=sse -funroll-loops -finline-functions -MT getpass.o -MD -MP -MF ".deps/getpass.Tpo" -c -o getpass.o getpass.c; \
        then mv -f ".deps/getpass.Tpo" ".deps/getpass.Po"; else rm -f ".deps/getpass.Tpo"; exit 1; fi
if i686-pc-linux-gnu-gcc -DHAVE_CONFIG_H  -I../src -I../include -I../src -I../lib  -I/usr/include/openssl -I/usr/include  -march=pentium4 -O2 -pipe -fomit-frame-pointer -mfpmath=sse -funroll-loops -finline-functions -MT homedir.o -MD -MP -MF ".deps/homedir.Tpo" -c -o homedir.o homedir.c; \
        then mv -f ".deps/homedir.Tpo" ".deps/homedir.Po"; else rm -f ".deps/homedir.Tpo"; exit 1; fi
make[2]: quittant le répertoire « /mnt/Z/portage/portage/curl-7.15.1-r1/work/curl-7.15.1/src »
make[1]: quittant le répertoire « /mnt/Z/portage/portage/curl-7.15.1-r1/work/curl-7.15.1/src »
In file included from main.c:99:
/usr/include/sys/poll.h:37: erreur: expected '=', ',', ';', 'asm' or '__attribute__' before 'int16_t'
/usr/include/sys/poll.h:43: erreur: expected ':', ',', ';', '}' or '__attribute__' before 'events'
/usr/include/sys/poll.h:58: erreur: expected declaration specifiers or '...' before 'nfds_t'
In file included from ../lib/setup.h:112,
                 from ../lib/strtoofft.h:31,
                 from ../lib/curlx.h:41,
                 from main.c:109:
/usr/include/assert.h:69: erreur: expected ';', ',' or ')' before '__line'
/usr/include/assert.h:74: erreur: expected ';', ',' or ')' before '__line'
In file included from ../lib/strtoofft.h:31,
                 from ../lib/curlx.h:41,
                 from main.c:109:
../lib/setup.h:243: erreur: conflicting types for 'fileno'
setup.h:86: erreur: previous declaration of 'fileno' was here
main.c:250: erreur: 'trace' redeclared as different kind of symbol
/usr/include/ncurses.h:1289: erreur: previous declaration of 'trace' was here
main.c:278: erreur: expected ':', ',', ';', '}' or '__attribute__' before 'porttouse'
main.c: In function 'warnf':
main.c:370: erreur: 'struct Configurable' has no member named 'conf'
main.c:383: erreur: 'struct Configurable' has no member named 'errors'
main.c:392: erreur: 'struct Configurable' has no member named 'errors'
main.c:393: erreur: 'struct Configurable' has no member named 'errors'
main.c:398: erreur: 'struct Configurable' has no member named 'errors'
main.c: In function 'clean_getout':
main.c:691: erreur: 'struct Configurable' has no member named 'url_list'
main.c: In function 'new_getout':
main.c:711: erreur: 'struct Configurable' has no member named 'url_last'
main.c:720: erreur: 'struct Configurable' has no member named 'url_list'
main.c:723: erreur: 'struct Configurable' has no member named 'url_last'
main.c: In function 'formparse':
main.c:1003: erreur: expected '=', ',', ';', 'asm' or '__attribute__' before 'i'
main.c:1003: erreur: 'i' undeclared (first use in this function)
main.c:1003: erreur: (Each undeclared identifier is reported only once
main.c:1003: erreur: for each function it appears in.)
main.c:1003: erreur: 'count' undeclared (first use in this function)
main.c: In function 'getparameter':
main.c:1270: erreur: expected '=', ',', ';', 'asm' or '__attribute__' before 'j'
main.c:1270: erreur: 'j' undeclared (first use in this function)
main.c:1491: erreur: 'struct Configurable' has no member named 'cipher_list'
main.c:1502: erreur: 'struct Configurable' has no member named 'trace_dump'
main.c:1503: erreur: 'struct Configurable' has no member named 'tracetype'
main.c:1506: erreur: 'struct Configurable' has no member named 'trace_dump'
main.c:1507: erreur: 'struct Configurable' has no member named 'tracetype'
main.c:1539: erreur: 'struct Configurable' has no member named 'recvpersecond'
main.c:1540: erreur: 'struct Configurable' has no member named 'sendpersecond'
main.c:1580: erreur: 'struct Configurable' has no member named 'ftp_create_dirs'
main.c:1584: erreur: 'struct Configurable' has no member named 'create_dirs'
main.c:1595: erreur: 'struct Configurable' has no member named 'proxyntlm'
main.c:1602: erreur: 'struct Configurable' has no member named 'crlf'
main.c:1608: erreur: 'struct Configurable' has no member named 'errors'
main.c:1611: erreur: 'struct Configurable' has no member named 'errors'
main.c:1612: erreur: 'struct Configurable' has no member named 'errors_fopened'
main.c:1616: erreur: 'struct Configurable' has no member named 'errors'
main.c:1625: erreur: 'struct Configurable' has no member named 'krb4level'
main.c:1640: erreur: 'struct Configurable' has no member named 'url_get'
main.c:1640: erreur: 'struct Configurable' has no member named 'url_get'
main.c:1640: erreur: 'struct Configurable' has no member named 'url_list'
main.c:1643: erreur: 'struct Configurable' has no member named 'url_get'
main.c:1643: erreur: 'struct Configurable' has no member named 'url_get'
main.c:1644: erreur: 'struct Configurable' has no member named 'url_get'
main.c:1644: erreur: 'struct Configurable' has no member named 'url_get'
main.c:1649: erreur: 'struct Configurable' has no member named 'url_get'
main.c:1651: erreur: 'struct Configurable' has no member named 'url_get'
main.c:1667: erreur: 'struct Configurable' has no member named 'ftp_ssl'
main.c:1675: erreur: 'struct Configurable' has no member named 'socks5proxy'
main.c:1678: erreur: 'struct Configurable' has no member named 'tcp_nodelay'
main.c:1681: erreur: 'struct Configurable' has no member named 'proxydigest'
main.c:1684: erreur: 'struct Configurable' has no member named 'proxybasic'
main.c:1687: erreur: 'struct Configurable' has no member named 'req_retry'
main.c:1691: erreur: 'struct Configurable' has no member named 'retry_delay'
main.c:1695: erreur: 'struct Configurable' has no member named 'retry_maxtime'
main.c:1700: erreur: 'struct Configurable' has no member named 'tp_url'
main.c:1703: erreur: 'struct Configurable' has no member named 'tp_user'
main.c:1712: erreur: 'struct Configurable' has no member named 'tp_postquote'
main.c:1717: erreur: 'struct Configurable' has no member named 'tp_prequote'
main.c:1720: erreur: 'struct Configurable' has no member named 'tp_quote'
main.c:1729: erreur: 'struct Configurable' has no member named 'ftp_account'
main.c:1732: erreur: 'struct Configurable' has no member named 'proxyanyauth'
main.c:1735: erreur: 'struct Configurable' has no member named 'tracetime'
main.c:1738: erreur: 'struct Configurable' has no member named 'ignorecl'
main.c:1741: erreur: 'struct Configurable' has no member named 'ftp_skip_ip'
main.c:1744: erreur: 'struct Configurable' has no member named 'ftp_filemethod'
main.c:1749: erreur: 'struct Configurable' has no member named 'progressmode'
main.c:1753: erreur: 'struct Configurable' has no member named 'httpversion'
main.c:1757: erreur: 'struct Configurable' has no member named 'ssl_version'
main.c:1761: erreur: 'struct Configurable' has no member named 'ssl_version'
main.c:1765: erreur: 'struct Configurable' has no member named 'ssl_version'
main.c:1769: erreur: 'struct Configurable' has no member named 'ip_version'
main.c:1773: erreur: 'struct Configurable' has no member named 'ip_version'
main.c:1777: erreur: 'struct Configurable' has no member named 'conf'
main.c:1797: erreur: 'struct Configurable' has no member named 'conf'
main.c:1889: erreur: 'struct Configurable' has no member named 'conf'
main.c:1899: erreur: 'struct Configurable' has no member named 'cacert'
main.c:1902: erreur: 'struct Configurable' has no member named 'cert_type'
main.c:1905: erreur: 'struct Configurable' has no member named 'key'
main.c:1908: erreur: 'struct Configurable' has no member named 'key_type'
main.c:1911: erreur: 'struct Configurable' has no member named 'key_passwd'
main.c:1915: erreur: 'struct Configurable' has no member named 'engine'
main.c:1916: erreur: 'struct Configurable' has no member named 'engine'
main.c:1916: erreur: 'struct Configurable' has no member named 'engine'
main.c:1917: erreur: 'struct Configurable' has no member named 'list_engines'
main.c:1921: erreur: 'struct Configurable' has no member named 'capath'
main.c:1946: erreur: 'struct Configurable' has no member named 'key_passwd'
main.c:1948: erreur: 'struct Configurable' has no member named 'cert'
main.c:1955: erreur: 'struct Configurable' has no member named 'conf'
main.c:1962: erreur: 'struct Configurable' has no member named 'httppost'
main.c:1963: erreur: 'struct Configurable' has no member named 'last_post'
main.c:1966: erreur: 'struct Configurable' has no member named 'httpreq'
main.c:1971: erreur: 'struct Configurable' has no member named 'globoff'
main.c:1975: erreur: 'struct Configurable' has no member named 'use_httpget'
main.c:1983: erreur: 'struct Configurable' has no member named 'headers'
main.c:1988: erreur: 'struct Configurable' has no member named 'conf'
main.c:1999: erreur: 'struct Configurable' has no member named 'conf'
main.c:2001: erreur: 'struct Configurable' has no member named 'conf'
main.c:2002: erreur: 'struct Configurable' has no member named 'httpreq'
main.c:2007: erreur: 'struct Configurable' has no member named 'conf'
main.c:2008: erreur: 'struct Configurable' has no member named 'httpreq'
main.c:2013: erreur: 'struct Configurable' has no member named 'insecure_ok'
main.c:2019: erreur: 'struct Configurable' has no member named 'conf'
main.c:2022: erreur: 'struct Configurable' has no member named 'conf'
main.c:2027: erreur: 'struct Configurable' has no member named 'conf'
main.c:2049: erreur: 'struct Configurable' has no member named 'conf'
main.c:2054: erreur: 'struct Configurable' has no member named 'conf'
main.c:2060: erreur: 'struct Configurable' has no member named 'nobuffer'
main.c:2067: erreur: 'struct Configurable' has no member named 'url_out'
main.c:2067: erreur: 'struct Configurable' has no member named 'url_out'
main.c:2067: erreur: 'struct Configurable' has no member named 'url_list'
main.c:2070: erreur: 'struct Configurable' has no member named 'url_out'
main.c:2070: erreur: 'struct Configurable' has no member named 'url_out'
main.c:2071: erreur: 'struct Configurable' has no member named 'url_out'
main.c:2071: erreur: 'struct Configurable' has no member named 'url_out'
main.c:2076: erreur: 'struct Configurable' has no member named 'url_out'
main.c:2078: erreur: 'struct Configurable' has no member named 'url_out'
main.c:2105: erreur: 'struct Configurable' has no member named 'proxytunnel'
main.c:2118: erreur: 'struct Configurable' has no member named 'postquote'
main.c:2123: erreur: 'struct Configurable' has no member named 'prequote'
main.c:2126: erreur: 'struct Configurable' has no member named 'quote'
main.c:2145: erreur: 'struct Configurable' has no member named 'range'
main.c:2149: erreur: 'struct Configurable' has no member named 'range'
main.c:2158: erreur: 'struct Configurable' has no member named 'conf'
main.c:2159: erreur: 'struct Configurable' has no member named 'showerror'
main.c:2163: erreur: 'struct Configurable' has no member named 'showerror'
main.c:2167: erreur: 'struct Configurable' has no member named 'telnet_options'
main.c:2175: erreur: 'struct Configurable' has no member named 'url_out'
main.c:2175: erreur: 'struct Configurable' has no member named 'url_out'
main.c:2175: erreur: 'struct Configurable' has no member named 'url_list'
main.c:2178: erreur: 'struct Configurable' has no member named 'url_out'
main.c:2178: erreur: 'struct Configurable' has no member named 'url_out'
main.c:2179: erreur: 'struct Configurable' has no member named 'url_out'
main.c:2179: erreur: 'struct Configurable' has no member named 'url_out'
main.c:2184: erreur: 'struct Configurable' has no member named 'url_out'
main.c:2186: erreur: 'struct Configurable' has no member named 'url_out'
main.c:2204: erreur: 'struct Configurable' has no member named 'userpwd'
main.c:2206: erreur: 'struct Configurable' has no member named 'userpwd'
main.c:2210: erreur: 'struct Configurable' has no member named 'proxyuserpwd'
main.c:2212: erreur: 'struct Configurable' has no member named 'proxyuserpwd'
main.c:2215: erreur: 'struct Configurable' has no member named 'trace_dump'
main.c:2216: erreur: 'struct Configurable' has no member named 'tracetype'
main.c:2231: erreur: expected '=', ',', ';', 'asm' or '__attribute__' before 'i'
main.c:2231: erreur: 'i' undeclared (first use in this function)
main.c:2237: attention : éléments en excès dans l'initialisation de la structure
main.c:2237: attention : (near initialization for 'feats[0]')
main.c:2237: attention : éléments en excès dans l'initialisation de la structure
main.c:2237: attention : (near initialization for 'feats[0]')
main.c:2238: attention : éléments en excès dans l'initialisation de la structure
main.c:2238: attention : (near initialization for 'feats[1]')
main.c:2238: attention : éléments en excès dans l'initialisation de la structure
main.c:2238: attention : (near initialization for 'feats[1]')
main.c:2239: attention : éléments en excès dans l'initialisation de la structure
main.c:2239: attention : (near initialization for 'feats[2]')
main.c:2239: attention : éléments en excès dans l'initialisation de la structure
main.c:2239: attention : (near initialization for 'feats[2]')
main.c:2240: attention : éléments en excès dans l'initialisation de la structure
main.c:2240: attention : (near initialization for 'feats[3]')
main.c:2240: attention : éléments en excès dans l'initialisation de la structure
main.c:2240: attention : (near initialization for 'feats[3]')
main.c:2241: attention : éléments en excès dans l'initialisation de la structure
main.c:2241: attention : (near initialization for 'feats[4]')
main.c:2241: attention : éléments en excès dans l'initialisation de la structure
main.c:2241: attention : (near initialization for 'feats[4]')
main.c:2242: attention : éléments en excès dans l'initialisation de la structure
main.c:2242: attention : (near initialization for 'feats[5]')
main.c:2242: attention : éléments en excès dans l'initialisation de la structure
main.c:2242: attention : (near initialization for 'feats[5]')
main.c:2243: attention : éléments en excès dans l'initialisation de la structure
main.c:2243: attention : (near initialization for 'feats[6]')
main.c:2243: attention : éléments en excès dans l'initialisation de la structure
main.c:2243: attention : (near initialization for 'feats[6]')
main.c:2244: attention : éléments en excès dans l'initialisation de la structure
main.c:2244: attention : (near initialization for 'feats[7]')
main.c:2244: attention : éléments en excès dans l'initialisation de la structure
main.c:2244: attention : (near initialization for 'feats[7]')
main.c:2245: attention : éléments en excès dans l'initialisation de la structure
main.c:2245: attention : (near initialization for 'feats[8]')
main.c:2245: attention : éléments en excès dans l'initialisation de la structure
main.c:2245: attention : (near initialization for 'feats[8]')
main.c:2246: attention : éléments en excès dans l'initialisation de la structure
main.c:2246: attention : (near initialization for 'feats[9]')
main.c:2246: attention : éléments en excès dans l'initialisation de la structure
main.c:2246: attention : (near initialization for 'feats[9]')
main.c:2247: attention : éléments en excès dans l'initialisation de la structure
main.c:2247: attention : (near initialization for 'feats[10]')
main.c:2247: attention : éléments en excès dans l'initialisation de la structure
main.c:2247: attention : (near initialization for 'feats[10]')
main.c:2248: attention : éléments en excès dans l'initialisation de la structure
main.c:2248: attention : (near initialization for 'feats[11]')
main.c:2248: attention : éléments en excès dans l'initialisation de la structure
main.c:2248: attention : (near initialization for 'feats[11]')
main.c:2251: attention : division par zéro
main.c:2270: erreur: 'struct Configurable' has no member named 'writeout'
main.c:2271: erreur: 'struct Configurable' has no member named 'writeout'
main.c:2277: erreur: 'struct Configurable' has no member named 'writeout'
main.c:2281: erreur: 'struct Configurable' has no member named 'proxy'
main.c:2285: erreur: 'struct Configurable' has no member named 'customrequest'
main.c:2289: erreur: 'struct Configurable' has no member named 'low_speed_time'
main.c:2291: erreur: 'struct Configurable' has no member named 'low_speed_limit'
main.c:2292: erreur: 'struct Configurable' has no member named 'low_speed_limit'
main.c:2296: erreur: 'struct Configurable' has no member named 'low_speed_limit'
main.c:2298: erreur: 'struct Configurable' has no member named 'low_speed_time'
main.c:2299: erreur: 'struct Configurable' has no member named 'low_speed_time'
main.c:2307: erreur: 'struct Configurable' has no member named 'timecond'
main.c:2311: erreur: 'struct Configurable' has no member named 'timecond'
main.c:2316: erreur: 'struct Configurable' has no member named 'timecond'
main.c:2320: erreur: 'now' undeclared (first use in this function)
main.c:2321: erreur: 'struct Configurable' has no member named 'condtime'
main.c:2322: erreur: 'struct Configurable' has no member named 'condtime'
main.c:2327: erreur: 'struct Configurable' has no member named 'timecond'
main.c:2335: erreur: 'struct Configurable' has no member named 'condtime'
main.c: In function 'go_sleep':
main.c:2566: erreur: too many arguments to function 'poll'
main.c: In function 'my_fwrite':
main.c:2614: erreur: 'struct Configurable' has no member named 'recvpersecond'
main.c:2628: erreur: 'struct Configurable' has no member named 'lastrecvtime'
main.c:2630: erreur: 'struct Configurable' has no member named 'recvpersecond'
main.c:2642: erreur: 'struct Configurable' has no member named 'recvpersecond'
main.c:2644: erreur: 'struct Configurable' has no member named 'recvpersecond'
main.c:2651: erreur: 'struct Configurable' has no member named 'low_speed_time'
main.c:2652: erreur: 'struct Configurable' has no member named 'low_speed_time'
main.c:2652: erreur: 'struct Configurable' has no member named 'low_speed_time'
main.c:2659: erreur: 'struct Configurable' has no member named 'lastrecvtime'
main.c:2670: erreur: 'struct Configurable' has no member named 'nobuffer'
main.c: In function 'my_fread':
main.c:2712: erreur: 'struct Configurable' has no member named 'sendpersecond'
main.c:2727: erreur: 'struct Configurable' has no member named 'lastsendtime'
main.c:2729: erreur: 'struct Configurable' has no member named 'sendpersecond'
main.c:2741: erreur: 'struct Configurable' has no member named 'lastsendsize'
main.c:2744: erreur: 'struct Configurable' has no member named 'sendpersecond'
main.c:2746: erreur: 'struct Configurable' has no member named 'sendpersecond'
main.c:2752: erreur: 'struct Configurable' has no member named 'lastsendtime'
main.c:2754: erreur: 'struct Configurable' has no member named 'sendpersecond'
main.c:2756: erreur: 'struct Configurable' has no member named 'sendpersecond'
main.c:2761: erreur: 'struct Configurable' has no member named 'lastsendsize'
main.c: In function 'progressbarinit':
main.c:2879: erreur: 'struct Configurable' has no member named 'errors'
main.c: Hors de toute fonction :
main.c:2884: erreur: two or more data types in declaration specifiers
main.c: In function 'dump':
main.c:2890: erreur: expected '=', ',', ';', 'asm' or '__attribute__' before 'width'
main.c:2890: erreur: 'width' undeclared (first use in this function)
main.c: Hors de toute fonction :
main.c:2934: erreur: two or more data types in declaration specifiers
main.c: In function 'my_trace':
main.c:2938: erreur: 'struct Configurable' has no member named 'errors'
main.c:2948: erreur: 'struct Configurable' has no member named 'tracetime'
main.c:2954: erreur: 'struct Configurable' has no member named 'trace_stream'
main.c:2956: erreur: 'struct Configurable' has no member named 'trace_dump'
main.c:2957: erreur: 'struct Configurable' has no member named 'trace_stream'
main.c:2958: erreur: 'struct Configurable' has no member named 'trace_dump'
main.c:2960: erreur: 'struct Configurable' has no member named 'trace_stream'
main.c:2962: erreur: 'struct Configurable' has no member named 'trace_stream'
main.c:2962: erreur: 'struct Configurable' has no member named 'trace_dump'
main.c:2963: erreur: 'struct Configurable' has no member named 'trace_fopened'
main.c:2967: erreur: 'struct Configurable' has no member named 'trace_stream'
main.c:2968: erreur: 'struct Configurable' has no member named 'trace_stream'
main.c:2970: erreur: 'struct Configurable' has no member named 'tracetype'
main.c:2987: erreur: 'struct Configurable' has no member named 'trace_stream'
main.c:2990: erreur: 'struct Configurable' has no member named 'trace_stream'
main.c:2996: erreur: 'struct Configurable' has no member named 'trace_stream'
main.c:2997: erreur: 'struct Configurable' has no member named 'trace_stream'
main.c:3002: erreur: 'struct Configurable' has no member named 'trace_stream'
main.c:3003: erreur: 'struct Configurable' has no member named 'trace_stream'
main.c:3042: erreur: 'struct Configurable' has no member named 'tracetype'
main.c: In function 'free_config_fields':
main.c:3052: erreur: 'struct Configurable' has no member named 'trace_dump'
main.c:3053: erreur: 'struct Configurable' has no member named 'trace_dump'
main.c:3054: erreur: 'struct Configurable' has no member named 'cipher_list'
main.c:3055: erreur: 'struct Configurable' has no member named 'cipher_list'
main.c:3056: erreur: 'struct Configurable' has no member named 'userpwd'
main.c:3057: erreur: 'struct Configurable' has no member named 'userpwd'
main.c:3060: erreur: 'struct Configurable' has no member named 'proxy'
main.c:3061: erreur: 'struct Configurable' has no member named 'proxy'
main.c:3062: erreur: 'struct Configurable' has no member named 'proxyuserpwd'
main.c:3063: erreur: 'struct Configurable' has no member named 'proxyuserpwd'
main.c:3068: erreur: 'struct Configurable' has no member named 'krb4level'
main.c:3069: erreur: 'struct Configurable' has no member named 'krb4level'
main.c:3074: erreur: 'struct Configurable' has no member named 'range'
main.c:3075: erreur: 'struct Configurable' has no member named 'range'
main.c:3076: erreur: 'struct Configurable' has no member named 'customrequest'
main.c:3077: erreur: 'struct Configurable' has no member named 'customrequest'
main.c:3078: erreur: 'struct Configurable' has no member named 'writeout'
main.c:3079: erreur: 'struct Configurable' has no member named 'writeout'
main.c:3080: erreur: 'struct Configurable' has no member named 'httppost'
main.c:3081: erreur: 'struct Configurable' has no member named 'httppost'
main.c:3082: erreur: 'struct Configurable' has no member named 'cacert'
main.c:3083: erreur: 'struct Configurable' has no member named 'cacert'
main.c:3084: erreur: 'struct Configurable' has no member named 'capath'
main.c:3085: erreur: 'struct Configurable' has no member named 'capath'
main.c:3088: erreur: 'struct Configurable' has no member named 'tp_url'
main.c:3089: erreur: 'struct Configurable' has no member named 'tp_url'
main.c:3090: erreur: 'struct Configurable' has no member named 'tp_user'
main.c:3091: erreur: 'struct Configurable' has no member named 'tp_user'
main.c:3092: erreur: 'struct Configurable' has no member named 'ftp_account'
main.c:3093: erreur: 'struct Configurable' has no member named 'ftp_account'
main.c:3095: erreur: 'struct Configurable' has no member named 'quote'
main.c:3096: erreur: 'struct Configurable' has no member named 'prequote'
main.c:3097: erreur: 'struct Configurable' has no member named 'postquote'
main.c:3098: erreur: 'struct Configurable' has no member named 'tp_quote'
main.c:3099: erreur: 'struct Configurable' has no member named 'tp_prequote'
main.c:3100: erreur: 'struct Configurable' has no member named 'tp_postquote'
main.c:3101: erreur: 'struct Configurable' has no member named 'headers'
main.c: In function 'operate':
main.c:3236: erreur: 'struct Configurable' has no member named 'showerror'
main.c:3237: erreur: 'struct Configurable' has no member named 'conf'
main.c:3238: erreur: 'struct Configurable' has no member named 'use_httpget'
main.c:3239: erreur: 'struct Configurable' has no member named 'create_dirs'
main.c:3240: erreur: 'struct Configurable' has no member named 'lastrecvtime'
main.c:3241: erreur: 'struct Configurable' has no member named 'lastsendtime'
main.c:3257: erreur: 'struct Configurable' has no member named 'url_list'
main.c:3301: erreur: 'struct Configurable' has no member named 'retry_delay'
main.c:3302: erreur: 'struct Configurable' has no member named 'retry_delay'
main.c:3305: erreur: 'struct Configurable' has no member named 'url_list'
main.c:3305: erreur: 'struct Configurable' has no member named 'url_list'
main.c:3305: erreur: 'struct Configurable' has no member named 'list_engines'
main.c:3328: erreur: 'struct Configurable' has no member named 'cacert'
main.c:3329: erreur: 'struct Configurable' has no member named 'capath'
main.c:3330: erreur: 'struct Configurable' has no member named 'insecure_ok'
main.c:3333: erreur: 'struct Configurable' has no member named 'cacert'
main.c:3337: erreur: 'struct Configurable' has no member named 'capath'
main.c:3341: erreur: 'struct Configurable' has no member named 'cacert'
main.c:3354: erreur: 'struct Configurable' has no member named 'use_httpget'
main.c:3360: erreur: 'struct Configurable' has no member named 'conf'
main.c:3361: erreur: 'struct Configurable' has no member named 'httpreq'
main.c:3367: erreur: 'struct Configurable' has no member named 'httpreq'
main.c:3383: erreur: 'struct Configurable' has no member named 'list_engines'
main.c:3396: erreur: 'struct Configurable' has no member named 'url_list'
main.c:3441: erreur: 'struct Configurable' has no member named 'globoff'
main.c:3444: erreur: 'struct Configurable' has no member named 'showerror'
main.c:3445: erreur: 'struct Configurable' has no member named 'errors'
main.c:3445: erreur: 'struct Configurable' has no member named 'errors'
main.c:3445: attention : passing argument 3 of 'glob_url' from incompatible pointer type
main.c:3464: erreur: 'struct Configurable' has no member named 'globoff'
main.c:3468: erreur: 'struct Configurable' has no member named 'showerror'
main.c:3469: erreur: 'struct Configurable' has no member named 'errors'
main.c:3469: erreur: 'struct Configurable' has no member named 'errors'
main.c:3469: attention : passing argument 3 of 'glob_url' from incompatible pointer type
main.c:3544: erreur: 'struct Configurable' has no member named 'create_dirs'
main.c:3670: erreur: 'struct Configurable' has no member named 'conf'
main.c:3672: erreur: 'struct Configurable' has no member named 'conf'
main.c:3717: erreur: 'struct Configurable' has no member named 'errors'
main.c:3718: erreur: 'struct Configurable' has no member named 'errors'
main.c:3721: erreur: 'struct Configurable' has no member named 'conf'
main.c:3728: erreur: 'struct Configurable' has no member named 'tcp_nodelay'
main.c:3747: erreur: 'struct Configurable' has no member named 'recvpersecond'
main.c:3750: erreur: 'struct Configurable' has no member named 'recvpersecond'
main.c:3756: erreur: 'struct Configurable' has no member named 'proxy'
main.c:3757: erreur: 'struct Configurable' has no member named 'conf'
main.c:3758: erreur: 'struct Configurable' has no member named 'conf'
main.c:3759: erreur: 'struct Configurable' has no member named 'conf'
main.c:3761: erreur: 'struct Configurable' has no member named 'conf'
main.c:3764: erreur: 'struct Configurable' has no member named 'conf'
main.c:3765: erreur: 'struct Configurable' has no member named 'conf'
main.c:3767: erreur: 'struct Configurable' has no member named 'conf'
main.c:3769: erreur: 'struct Configurable' has no member named 'conf'
main.c:3775: erreur: 'struct Configurable' has no member named 'conf'
main.c:3777: erreur: 'struct Configurable' has no member named 'conf'
main.c:3778: erreur: 'struct Configurable' has no member named 'conf'
main.c:3779: erreur: 'struct Configurable' has no member named 'userpwd'
main.c:3780: erreur: 'struct Configurable' has no member named 'proxyuserpwd'
main.c:3781: erreur: 'struct Configurable' has no member named 'range'
main.c:3785: erreur: 'struct Configurable' has no member named 'httpreq'
main.c:3791: erreur: 'struct Configurable' has no member named 'httppost'
main.c:3798: erreur: 'struct Configurable' has no member named 'conf'
main.c:3801: erreur: 'struct Configurable' has no member named 'low_speed_limit'
main.c:3802: erreur: 'struct Configurable' has no member named 'low_speed_time'
main.c:3806: erreur: 'struct Configurable' has no member named 'headers'
main.c:3807: erreur: 'struct Configurable' has no member named 'cert'
main.c:3808: erreur: 'struct Configurable' has no member named 'cert_type'
main.c:3809: erreur: 'struct Configurable' has no member named 'key'
main.c:3810: erreur: 'struct Configurable' has no member named 'key_type'
main.c:3811: erreur: 'struct Configurable' has no member named 'key_passwd'
main.c:3815: erreur: 'struct Configurable' has no member named 'cacert'
main.c:3815: erreur: 'struct Configurable' has no member named 'capath'
main.c:3816: erreur: 'struct Configurable' has no member named 'cacert'
main.c:3817: erreur: 'struct Configurable' has no member named 'cacert'
main.c:3819: erreur: 'struct Configurable' has no member named 'capath'
main.c:3820: erreur: 'struct Configurable' has no member named 'capath'
main.c:3823: erreur: 'struct Configurable' has no member named 'insecure_ok'
main.c:3829: erreur: 'struct Configurable' has no member named 'conf'
main.c:3836: erreur: 'struct Configurable' has no member named 'crlf'
main.c:3837: erreur: 'struct Configurable' has no member named 'quote'
main.c:3838: erreur: 'struct Configurable' has no member named 'postquote'
main.c:3839: erreur: 'struct Configurable' has no member named 'prequote'
main.c:3849: erreur: 'struct Configurable' has no member named 'ssl_version'
main.c:3850: erreur: 'struct Configurable' has no member named 'timecond'
main.c:3851: erreur: 'struct Configurable' has no member named 'condtime'
main.c:3852: erreur: 'struct Configurable' has no member named 'customrequest'
main.c:3853: erreur: 'struct Configurable' has no member named 'errors'
main.c:3856: erreur: 'struct Configurable' has no member named 'proxytunnel'
main.c:3858: erreur: 'struct Configurable' has no member named 'krb4level'
main.c:3861: erreur: 'struct Configurable' has no member named 'progressmode'
main.c:3862: erreur: 'struct Configurable' has no member named 'conf'
main.c:3870: erreur: 'struct Configurable' has no member named 'telnet_options'
main.c:3877: erreur: 'struct Configurable' has no member named 'cipher_list'
main.c:3878: erreur: 'struct Configurable' has no member named 'cipher_list'
main.c:3880: erreur: 'struct Configurable' has no member named 'httpversion'
main.c:3881: erreur: 'struct Configurable' has no member named 'httpversion'
main.c:3898: erreur: 'struct Configurable' has no member named 'trace_dump'
main.c:3907: erreur: 'struct Configurable' has no member named 'engine'
main.c:3908: erreur: 'struct Configurable' has no member named 'engine'
main.c:3921: erreur: 'struct Configurable' has no member named 'ftp_create_dirs'
main.c:3922: erreur: 'struct Configurable' has no member named 'proxyanyauth'
main.c:3924: erreur: 'struct Configurable' has no member named 'proxyntlm'
main.c:3926: erreur: 'struct Configurable' has no member named 'proxydigest'
main.c:3928: erreur: 'struct Configurable' has no member named 'proxybasic'
main.c:3936: erreur: 'struct Configurable' has no member named 'ip_version'
main.c:3938: erreur: 'struct Configurable' has no member named 'ip_version'
main.c:3944: erreur: 'struct Configurable' has no member named 'ftp_ssl'
main.c:3948: erreur: 'struct Configurable' has no member named 'socks5proxy'
main.c:3949: erreur: 'struct Configurable' has no member named 'socks5proxy'
main.c:3954: erreur: 'struct Configurable' has no member named 'tp_url'
main.c:3955: erreur: 'struct Configurable' has no member named 'tp_user'
main.c:3956: erreur: 'struct Configurable' has no member named 'tp_prequote'
main.c:3957: erreur: 'struct Configurable' has no member named 'tp_postquote'
main.c:3958: erreur: 'struct Configurable' has no member named 'tp_quote'
main.c:3959: erreur: 'struct Configurable' has no member named 'ftp_account'
main.c:3961: erreur: 'struct Configurable' has no member named 'ignorecl'
main.c:3964: erreur: 'struct Configurable' has no member named 'ftp_skip_ip'
main.c:3967: erreur: 'struct Configurable' has no member named 'ftp_filemethod'
main.c:3969: erreur: 'struct Configurable' has no member named 'req_retry'
main.c:3979: erreur: 'struct Configurable' has no member named 'retry_maxtime'
main.c:3981: erreur: 'struct Configurable' has no member named 'retry_maxtime'
main.c:4049: erreur: 'struct Configurable' has no member named 'retry_delay'
main.c:4057: erreur: 'struct Configurable' has no member named 'conf'
main.c:4086: erreur: 'struct Configurable' has no member named 'progressmode'
main.c:4093: erreur: 'struct Configurable' has no member named 'writeout'
main.c:4094: erreur: 'struct Configurable' has no member named 'writeout'
main.c:4108: erreur: 'struct Configurable' has no member named 'showerror'
main.c:4109: erreur: 'struct Configurable' has no member named 'errors'
main.c:4128: erreur: 'struct Configurable' has no member named 'errors'
main.c:4210: erreur: 'struct Configurable' has no member named 'engine'
main.c:4211: erreur: 'struct Configurable' has no member named 'engine'
main.c:4222: erreur: 'struct Configurable' has no member named 'trace_fopened'
main.c:4222: erreur: 'struct Configurable' has no member named 'trace_stream'
main.c:4223: erreur: 'struct Configurable' has no member named 'trace_stream'
main.c:4225: erreur: 'struct Configurable' has no member named 'errors_fopened'
main.c:4226: erreur: 'struct Configurable' has no member named 'errors'
main.c: In function 'checkfds':
main.c:4245: attention : passing argument 1 of 'pipe' from incompatible pointer type
main.c: In function 'main':
main.c:4260: erreur: 'struct Configurable' has no member named 'errors'
main.c:4255: attention : return type of 'main' is not 'int'
make[2]: *** [main.o] Erreur 1
make[2]: *** Attente des tâches non terminées....
make[1]: *** [all] Erreur 2
make: *** [all-recursive] Erreur 1

!!! ERROR: net-misc/curl-7.15.1-r1 failed.
Call stack:
  ebuild.sh, line 1546:   Called dyn_compile
  ebuild.sh, line 937:   Called src_compile
  curl-7.15.1-r1.ebuild, line 83:   Called die

!!! install failed for current version
!!! If you need support, post the topmost build error, and the call stack if relevant.