All pastes #235643 Raw Edit

Miscellany

public text v1 · immutable
·published 2006-11-03 10:59 UTC
rendered paste body
/bin/sh ../../libtool --silent --mode=link --tag=CXX i686-pc-linux-gnu-g++  -Wno-long-long -Wundef -ansi -D_XOPEN_SOURCE=500 -D_BSD_SOURCE -Wcast-align -Wconversion -Wchar-subscripts -Wall -W -Wpointer-arith -DNDEBUG -DNO_DEBUG -O2 -O2 -march=pentium-m -pipe -fomit-frame-pointer -fno-inline -Wformat-security -Wmissing-format-attribute -Wno-non-virtual-dtor -fno-exceptions -fno-check-new -fno-common -DQT_CLEAN_NAMESPACE -DQT_NO_ASCII_CAST -DQT_NO_STL -DQT_NO_COMPAT -DQT_NO_TRANSLATION    -o amarokapp -L/usr/kde/3.5/lib -L/usr/qt/3/lib -L/usr/lib    -L/usr/kde/3.5/lib -R /usr/lib -R /usr/kde/3.5/lib -R /usr/qt/3/lib -R /usr/lib -R /usr/kde/3.5/lib main.o ../../amarok/src/amarokcore/libamarokcore.la libamarok.la ../../amarok/src/analyzers/libanalyzers.la ../../amarok/src/plugin/libplugin.la ../../amarok/src/statusbar/libstatusbar.la ../../amarok/src/metadata/libmetadata.la -lkutils -lkio -lkdeui -lkdecore -lkhtml -lknewstuff -L/usr/lib -ltag -lGL  ../../amarok/src/sqlite/libsqlite.la    -L/usr/lib -lpq 
/usr/kde/3.5/lib/libkhtml.so: undefined reference to `__cxa_get_exception_ptr@CXXABI_1.3.1'
collect2: ld returned 1 exit status
distcc[20310] ERROR: compile (null) on localhost failed
make[4]: *** [amarokapp] Error 1
make[4]: Leaving directory `/mnt/bigdisk/inst/portage/media-sound/amarok-1.4.4/work/amarok-1.4.4/amarok/src'
make[3]: *** [all-recursive] Error 1
make[3]: Leaving directory `/mnt/bigdisk/inst/portage/media-sound/amarok-1.4.4/work/amarok-1.4.4/amarok/src'
make[2]: *** [all-recursive] Error 1
make[2]: Leaving directory `/mnt/bigdisk/inst/portage/media-sound/amarok-1.4.4/work/amarok-1.4.4/amarok'
make[1]: *** [all-recursive] Error 1
make[1]: Leaving directory `/mnt/bigdisk/inst/portage/media-sound/amarok-1.4.4/work/amarok-1.4.4'
make: *** [all] Error 2

!!! ERROR: media-sound/amarok-1.4.4 failed.
Call stack:
  ebuild.sh, line 1568:   Called dyn_compile
  ebuild.sh, line 937:   Called src_compile
  amarok-1.4.4.ebuild, line 76:   Called kde_src_compile
  kde.eclass, line 172:   Called kde_src_compile 'all'
  kde.eclass, line 342:   Called kde_src_compile 'myconf' 'configure' 'make'
  kde.eclass, line 338:   Called die

!!! died running emake, kde_src_compile:make
!!! If you need support, post the topmost build error, and the call stack if relevant.