#make linux
make: Warning: File `Makefile' has modification time 5.4e+06 s in the future
g++ -c -W -Wall -g -I/usr/local/ssl/include -Iinclude src/fpwhitelist.cc -o src/fpwhitelist.o
In file included from include/fpwhitelist.h:4,
from src/fpwhitelist.cc:1:
include/global.h:8:25: openssl/ssl.h: No such file or directory
include/global.h:9:26: openssl/rand.h: No such file or directory
include/global.h:10:25: openssl/err.h: No such file or directory
include/global.h:11:25: openssl/sha.h: No such file or directory
In file included from include/fpwhitelist.h:6,
from src/fpwhitelist.cc:1:
include/tools.h:31: error: `SSL' has not been declared
include/tools.h:31: error: ISO C++ forbids declaration of `parameter' with no type
include/tools.h:32: error: `SSL' has not been declared
include/tools.h:32: error: ISO C++ forbids declaration of `parameter' with no type
include/tools.h:35: error: `SSL' has not been declared
include/tools.h:35: error: `SSL_CTX' has not been declared
include/tools.h:35: error: ISO C++ forbids declaration of `parameter' with no type
include/tools.h:35: error: ISO C++ forbids declaration of `parameter' with no type
include/tools.h:36: error: `SSL' has not been declared
include/tools.h:36: error: `SSL_CTX' has not been declared
include/tools.h:36: error: ISO C++ forbids declaration of `parameter' with no type
include/tools.h:36: error: ISO C++ forbids declaration of `parameter' with no type
include/tools.h:41: error: `SSL' has not been declared
include/tools.h:41: error: ISO C++ forbids declaration of `parameter' with no type
include/tools.h:42: error: `SSL' has not been declared
include/tools.h:42: error: ISO C++ forbids declaration of `parameter' with no type
include/tools.h:56: error: `SSL' has not been declared
include/tools.h:56: error: ISO C++ forbids declaration of `parameter' with no type
include/tools.h:57: error: `SSL' has not been declared
include/tools.h:57: error: `SSL_CTX' has not been declared
include/tools.h:57: error: ISO C++ forbids declaration of `parameter' with no type
include/tools.h:57: error: ISO C++ forbids declaration of `parameter' with no type
include/tools.h:62: error: `SSL' was not declared in this scope
include/tools.h:62: error: expected primary-expression before ')' token
make: *** [src/fpwhitelist.o] Error 1