scons: Reading SConscript files ...
[95mCommand-line arguments[0m
[93mNo command-line arguments given[0m
[95mCommand-line targets[0m
[93mNo targets given, using [0m[92mdefault[0m
[92mUsing config file: [0mconfig/freebsd6-config.py
[93muser-config.py not found, no user overrides[0m
[95mBuilding in [0m../build/freebsd6/
[95mConfiguring library [0m[92mbf_soundsystem[0m
[95mConfiguring library [0m[92mbf_string[0m
[95mConfiguring library [0m[92mbf_ghost[0m
[95mConfiguring library [0m[92mbf_guardedalloc[0m
[95mConfiguring library [0m[92mbf_bmfont[0m
[95mConfiguring library [0m[92mbf_moto[0m
[95mConfiguring library [0m[92mblender_CTR[0m
[95mConfiguring library [0m[92mbf_memutil[0m
[95mConfiguring library [0m[92mbf_decimation[0m
[95mConfiguring library [0m[92mblender_IK[0m
[95mConfiguring library [0m[92mblender_bop[0m
[95mConfiguring library [0m[92mblender_ONL[0m
[95mConfiguring library [0m[92mbf_elbeem[0m
[95mConfiguring library [0m[92mblender_BSP[0m
[95mConfiguring library [0m[92mextern_qhull[0m
################################################
Check if solid builds on your platform correctly
Add your platform specific defines
and cflags / cxxflags to the
extern/solid/SConscript file
[95mConfiguring library [0m[92mextern_solid[0m
[95mConfiguring library [0m[92mextern_bullet[0m
[95mConfiguring library [0m[92mextern_ftgl[0m
[95mConfiguring library [0m[92mbf_avi[0m
[95mConfiguring library [0m[92mbf_blenkernel[0m
[95mConfiguring library [0m[92mbf_blenlib[0m
[95mConfiguring library [0m[92mbf_blenloader[0m
[95mConfiguring library [0m[92mbf_blenpluginapi[0m
[95mConfiguring library [0m[92mbf_imbuf[0m
[95mConfiguring library [0m[92mbf_cineon[0m
[95mConfiguring library [0m[92mblender_img[0m
[95mConfiguring library [0m[92mbf_dna[0m
[95mConfiguring library [0m[92mblender_python[0m
[95mConfiguring library [0m[92mblender_radiosity[0m
[95mConfiguring library [0m[92mbf_readblenfile[0m
[95mConfiguring library [0m[92mblender_render[0m
[95mConfiguring library [0m[92msrc[0m
[95mConfiguring library [0m[92mbf_yafray[0m
[95mConfiguring library [0m[92mbf_ftfont[0m
[95mConfiguring library [0m[92mbf_kernel[0m
[95mConfiguring library [0m[92mblender_creator[0m
[95mConfiguring library [0m[92mbf_bloutines[0m
[95mConfiguring library [0m[92mbf_converter[0m
[95mConfiguring library [0m[92mbf_expressions[0m
[95mConfiguring library [0m[92mbf_logic[0m
[95mConfiguring library [0m[92mbf_ketsji[0m
[95mConfiguring library [0m[92mkx_network[0m
[95mConfiguring library [0m[92mbf_ngnetwork[0m
[95mConfiguring library [0m[92mbf_loopbacknetwork[0m
[95mConfiguring library [0m[92mbf_common[0m
[95mConfiguring library [0m[92mbf_dummy[0m
[95mConfiguring library [0m[92mbf_rasterizer[0m
[95mConfiguring library [0m[92mbf_oglrasterizer[0m
[95mConfiguring library [0m[92mbf_scenegraph[0m
[95mConfiguring library [0m[92mbf_bullet[0m
[95mConfiguring library [0m[92mbf_sumo[0m
[95mConfiguring program [0m[92mblender[0m
scons: done reading SConscript files.
scons: Building targets ...
scons: `/home/silkmare/projects/blender_cvs/build/freebsd6/lib/libbf_soundsystem.a' is up to date.
scons: `/home/silkmare/projects/blender_cvs/build/freebsd6/lib/libbf_string.a' is up to date.
scons: `/home/silkmare/projects/blender_cvs/build/freebsd6/lib/libbf_ghost.a' is up to date.
scons: `/home/silkmare/projects/blender_cvs/build/freebsd6/lib/libbf_guardedalloc.a' is up to date.
scons: `/home/silkmare/projects/blender_cvs/build/freebsd6/lib/libbf_bmfont.a' is up to date.
scons: `/home/silkmare/projects/blender_cvs/build/freebsd6/lib/libbf_moto.a' is up to date.
scons: `/home/silkmare/projects/blender_cvs/build/freebsd6/lib/libblender_CTR.a' is up to date.
scons: `/home/silkmare/projects/blender_cvs/build/freebsd6/lib/libbf_memutil.a' is up to date.
scons: `/home/silkmare/projects/blender_cvs/build/freebsd6/lib/libbf_decimation.a' is up to date.
scons: `/home/silkmare/projects/blender_cvs/build/freebsd6/lib/libblender_IK.a' is up to date.
scons: `/home/silkmare/projects/blender_cvs/build/freebsd6/lib/libblender_bop.a' is up to date.
scons: `/home/silkmare/projects/blender_cvs/build/freebsd6/lib/libblender_ONL.a' is up to date.
scons: `/home/silkmare/projects/blender_cvs/build/freebsd6/lib/libbf_elbeem.a' is up to date.
scons: `/home/silkmare/projects/blender_cvs/build/freebsd6/lib/libblender_BSP.a' is up to date.
scons: `/home/silkmare/projects/blender_cvs/build/freebsd6/lib/libextern_qhull.a' is up to date.
scons: `/home/silkmare/projects/blender_cvs/build/freebsd6/lib/libextern_solid.a' is up to date.
scons: `/home/silkmare/projects/blender_cvs/build/freebsd6/lib/libextern_bullet.a' is up to date.
scons: `/home/silkmare/projects/blender_cvs/build/freebsd6/lib/libextern_ftgl.a' is up to date.
scons: `/home/silkmare/projects/blender_cvs/build/freebsd6/lib/libbf_avi.a' is up to date.
scons: `/home/silkmare/projects/blender_cvs/build/freebsd6/lib/libbf_blenkernel.a' is up to date.
scons: `/home/silkmare/projects/blender_cvs/build/freebsd6/lib/libbf_blenlib.a' is up to date.
scons: `/home/silkmare/projects/blender_cvs/build/freebsd6/lib/libbf_blenloader.a' is up to date.
scons: `/home/silkmare/projects/blender_cvs/build/freebsd6/lib/libbf_blenpluginapi.a' is up to date.
scons: `/home/silkmare/projects/blender_cvs/build/freebsd6/lib/libbf_imbuf.a' is up to date.
scons: `/home/silkmare/projects/blender_cvs/build/freebsd6/lib/libbf_cineon.a' is up to date.
scons: `/home/silkmare/projects/blender_cvs/build/freebsd6/lib/libblender_img.a' is up to date.
scons: `/home/silkmare/projects/blender_cvs/build/freebsd6/lib/libbf_dna.a' is up to date.
scons: `/home/silkmare/projects/blender_cvs/build/freebsd6/lib/libblender_python.a' is up to date.
scons: `/home/silkmare/projects/blender_cvs/build/freebsd6/lib/libblender_radiosity.a' is up to date.
scons: `/home/silkmare/projects/blender_cvs/build/freebsd6/lib/libbf_readblenfile.a' is up to date.
scons: `/home/silkmare/projects/blender_cvs/build/freebsd6/lib/libblender_render.a' is up to date.
scons: `/home/silkmare/projects/blender_cvs/build/freebsd6/lib/libsrc.a' is up to date.
scons: `/home/silkmare/projects/blender_cvs/build/freebsd6/lib/libbf_yafray.a' is up to date.
scons: `/home/silkmare/projects/blender_cvs/build/freebsd6/lib/libbf_ftfont.a' is up to date.
scons: `/home/silkmare/projects/blender_cvs/build/freebsd6/lib/libbf_kernel.a' is up to date.
scons: `/home/silkmare/projects/blender_cvs/build/freebsd6/lib/libblender_creator.a' is up to date.
scons: `/home/silkmare/projects/blender_cvs/build/freebsd6/lib/libbf_bloutines.a' is up to date.
[94mCompiling[0m ==> '[92mBL_ActionActuator.cpp'[0m
In file included from /usr/include/c++/3.4/ios:48,
from /usr/include/c++/3.4/ostream:45,
from /usr/include/c++/3.4/iostream:45,
from intern/moto/include/MT_Stream.h:49,
from intern/moto/include/MT_Tuple3.h:49,
from intern/moto/include/MT_Vector3.h:50,
from intern/moto/include/MT_Point3.h:49,
from source/gameengine/Converter/BL_ActionActuator.h:38,
from source/gameengine/Converter/BL_ActionActuator.cpp:40:
/usr/include/c++/3.4/bits/localefwd.h:58:34: macro "isspace" passed 2 arguments, but takes just 1
In file included from /usr/include/c++/3.4/ios:48,
from /usr/include/c++/3.4/ostream:45,
from /usr/include/c++/3.4/iostream:45,
from intern/moto/include/MT_Stream.h:49,
from intern/moto/include/MT_Tuple3.h:49,
from intern/moto/include/MT_Vector3.h:50,
from intern/moto/include/MT_Point3.h:49,
from source/gameengine/Converter/BL_ActionActuator.h:38,
from source/gameengine/Converter/BL_ActionActuator.cpp:40:
/usr/include/c++/3.4/bits/localefwd.h:58: error: `std::isspace' declared as an `inline' variable
/usr/include/c++/3.4/bits/localefwd.h:58: error: template declaration of `bool std::isspace'
/usr/include/c++/3.4/bits/localefwd.h:70:34: macro "isupper" passed 2 arguments, but takes just 1
/usr/include/c++/3.4/bits/localefwd.h:70: error: `std::isupper' declared as an `inline' variable
/usr/include/c++/3.4/bits/localefwd.h:70: error: template declaration of `bool std::isupper'
/usr/include/c++/3.4/bits/localefwd.h:74:34: macro "islower" passed 2 arguments, but takes just 1
/usr/include/c++/3.4/bits/localefwd.h:74: error: `std::islower' declared as an `inline' variable
/usr/include/c++/3.4/bits/localefwd.h:74: error: template declaration of `bool std::islower'
/usr/include/c++/3.4/bits/localefwd.h:78:34: macro "isalpha" passed 2 arguments, but takes just 1
/usr/include/c++/3.4/bits/localefwd.h:78: error: `std::isalpha' declared as an `inline' variable
/usr/include/c++/3.4/bits/localefwd.h:78: error: template declaration of `bool std::isalpha'
/usr/include/c++/3.4/bits/localefwd.h:94:34: macro "isalnum" passed 2 arguments, but takes just 1
/usr/include/c++/3.4/bits/localefwd.h:94: error: `std::isalnum' declared as an `inline' variable
/usr/include/c++/3.4/bits/localefwd.h:94: error: template declaration of `bool std::isalnum'
/usr/include/c++/3.4/bits/localefwd.h:102:34: macro "toupper" passed 2 arguments, but takes just 1
/usr/include/c++/3.4/bits/localefwd.h:102: error: `std::toupper' declared as an `inline' variable
/usr/include/c++/3.4/bits/localefwd.h:102: error: template declaration of `_CharT std::toupper'
/usr/include/c++/3.4/bits/localefwd.h:106:34: macro "tolower" passed 2 arguments, but takes just 1
/usr/include/c++/3.4/bits/localefwd.h:106: error: `std::tolower' declared as an `inline' variable
/usr/include/c++/3.4/bits/localefwd.h:106: error: template declaration of `_CharT std::tolower'
In file included from /usr/include/c++/3.4/bits/basic_ios.h:44,
from /usr/include/c++/3.4/ios:51,
from /usr/include/c++/3.4/ostream:45,
from /usr/include/c++/3.4/iostream:45,
from intern/moto/include/MT_Stream.h:49,
from intern/moto/include/MT_Tuple3.h:49,
from intern/moto/include/MT_Vector3.h:50,
from intern/moto/include/MT_Point3.h:49,
from source/gameengine/Converter/BL_ActionActuator.h:38,
from source/gameengine/Converter/BL_ActionActuator.cpp:40:
/usr/include/c++/3.4/bits/locale_facets.h:226: error: `btowc' is not a type
In file included from /usr/include/c++/3.4/bits/basic_ios.h:44,
from /usr/include/c++/3.4/ios:51,
from /usr/include/c++/3.4/ostream:45,
from /usr/include/c++/3.4/iostream:45,
from intern/moto/include/MT_Stream.h:49,
from intern/moto/include/MT_Tuple3.h:49,
from intern/moto/include/MT_Vector3.h:50,
from intern/moto/include/MT_Point3.h:49,
from source/gameengine/Converter/BL_ActionActuator.h:38,
from source/gameengine/Converter/BL_ActionActuator.cpp:40:
/usr/include/c++/3.4/bits/locale_facets.h:241:53: macro "toupper" passed 2 arguments, but takes just 1
/usr/include/c++/3.4/bits/locale_facets.h:241: error: expected `;' before "const"
/usr/include/c++/3.4/bits/locale_facets.h:254: error: expected `;' before "char_type"
/usr/include/c++/3.4/bits/locale_facets.h:255: error: `btowc' is not a type
/usr/include/c++/3.4/bits/locale_facets.h:270:53: macro "tolower" passed 2 arguments, but takes just 1
/usr/include/c++/3.4/bits/locale_facets.h:270: error: expected `;' before "const"
/usr/include/c++/3.4/bits/locale_facets.h:286: error: expected `;' before "char_type"
/usr/include/c++/3.4/bits/locale_facets.h: In member function `_CharT std::__ctype_abstract_base<_CharT>::towupper(int (*)(_CharT)) const':
/usr/include/c++/3.4/bits/locale_facets.h:227: error: `__c' was not declared in this scope
/usr/include/c++/3.4/bits/locale_facets.h: In member function `_CharT std::__ctype_abstract_base<_CharT>::towlower(int (*)(_CharT)) const':
/usr/include/c++/3.4/bits/locale_facets.h:256: error: `__c' was not declared in this scope
/usr/include/c++/3.4/bits/locale_facets.h: At global scope:
/usr/include/c++/3.4/bits/locale_facets.h:796: error: `btowc' is not a type
/usr/include/c++/3.4/bits/locale_facets.h:813:53: macro "toupper" passed 2 arguments, but takes just 1
/usr/include/c++/3.4/bits/locale_facets.h:813: error: expected `;' before "const"
/usr/include/c++/3.4/bits/locale_facets.h:828: error: expected `;' before "char_type"
/usr/include/c++/3.4/bits/locale_facets.h:829: error: `btowc' is not a type
/usr/include/c++/3.4/bits/locale_facets.h:846:53: macro "tolower" passed 2 arguments, but takes just 1
/usr/include/c++/3.4/bits/locale_facets.h:846: error: expected `;' before "const"
/usr/include/c++/3.4/bits/locale_facets.h:865: error: expected `;' before "char_type"
/usr/include/c++/3.4/bits/locale_facets.h: In member function `char std::ctype<char>::towupper(int (*)(char)) const':
/usr/include/c++/3.4/bits/locale_facets.h:797: error: `__c' was not declared in this scope
/usr/include/c++/3.4/bits/locale_facets.h: In member function `char std::ctype<char>::towlower(int (*)(char)) const':
/usr/include/c++/3.4/bits/locale_facets.h:830: error: `__c' was not declared in this scope
/usr/include/c++/3.4/bits/locale_facets.h:4494:44: macro "isspace" passed 2 arguments, but takes just 1
In file included from /usr/include/c++/3.4/bits/basic_ios.h:44,
from /usr/include/c++/3.4/ios:51,
from /usr/include/c++/3.4/ostream:45,
from /usr/include/c++/3.4/iostream:45,
from intern/moto/include/MT_Stream.h:49,
from intern/moto/include/MT_Tuple3.h:49,
from intern/moto/include/MT_Vector3.h:50,
from intern/moto/include/MT_Point3.h:49,
from source/gameengine/Converter/BL_ActionActuator.h:38,
from source/gameengine/Converter/BL_ActionActuator.cpp:40:
/usr/include/c++/3.4/bits/locale_facets.h: At global scope:
/usr/include/c++/3.4/bits/locale_facets.h:4495: error: invalid function declaration
/usr/include/c++/3.4/bits/locale_facets.h:4509:44: macro "isupper" passed 2 arguments, but takes just 1
/usr/include/c++/3.4/bits/locale_facets.h:4510: error: invalid function declaration
/usr/include/c++/3.4/bits/locale_facets.h:4513:56: macro "islower" passed 2 arguments, but takes just 1
/usr/include/c++/3.4/bits/locale_facets.h:4514: error: invalid function declaration
/usr/include/c++/3.4/bits/locale_facets.h:4518:44: macro "isalpha" passed 2 arguments, but takes just 1
/usr/include/c++/3.4/bits/locale_facets.h:4519: error: invalid function declaration
/usr/include/c++/3.4/bits/locale_facets.h:4538:44: macro "isalnum" passed 2 arguments, but takes just 1
/usr/include/c++/3.4/bits/locale_facets.h:4539: error: invalid function declaration
/usr/include/c++/3.4/bits/locale_facets.h:4548:44: macro "toupper" passed 2 arguments, but takes just 1
/usr/include/c++/3.4/bits/locale_facets.h:4549: error: invalid function declaration
/usr/include/c++/3.4/bits/locale_facets.h:4553:44: macro "tolower" passed 2 arguments, but takes just 1
/usr/include/c++/3.4/bits/locale_facets.h:4554: error: invalid function declaration
In file included from source/gameengine/Converter/BL_SkinDeformer.h:41,
from source/gameengine/Converter/BL_ActionActuator.cpp:42:
source/gameengine/Converter/BL_MeshDeformer.h: In constructor `BL_MeshDeformer::BL_MeshDeformer(Object*, BL_SkinMeshObject*)':
source/gameengine/Converter/BL_MeshDeformer.h:74: warning: `BL_MeshDeformer::m_objMesh' will be initialized after
source/gameengine/Converter/BL_MeshDeformer.h:68: warning: `MT_Point3*BL_MeshDeformer::m_transnors'
source/gameengine/Converter/BL_MeshDeformer.h:58: warning: when initialized here
scons: *** [/home/silkmare/projects/blender_cvs/build/freebsd6/source/gameengine/Converter/BL_ActionActuator.o] Error 1
scons: building terminated because of errors.