All pastes #233486 Raw Edit

Someone

public text v1 · immutable
·published 2006-11-01 23:42 UTC
rendered paste body
Building in directory: MODLOAD-2.6.17-10-generic-MP
make[5]: Entering directory `/usr/src/modules/openafs/src/libafs/MODLOAD-2.6.17-10-generic-MP'
Makefile.common:50: warning: overriding commands for target `.c.o'
/usr/src/modules/openafs/src/config/Makefile.config:132: warning: ignoring old commands for target `.c.o'
Makefile.afs:163: target `openafs.ko' given more than once in the same rule.
Makefile.afs:168: warning: overriding commands for target `openafs.ko'
Makefile.afs:164: warning: ignoring old commands for target `openafs.ko'
Makefile.afs:200: warning: overriding commands for target `/usr/src/modules/openafs/debian/tmp/lib/openafs/openafs.ko'
Makefile.afs:197: warning: ignoring old commands for target `/usr/src/modules/openafs/debian/tmp/lib/openafs/openafs.ko'
make[5]: Circular openafs.ko <- openafs.ko dependency dropped.
make[5]: Circular openafs.ko <- openafs.ko dependency dropped.
env EXTRA_CFLAGS="" /usr/src/modules/openafs/src/libafs/make_kbuild_makefile.pl MODLOAD-2.6.17-10-generic-MP openafs.ko /usr/src/modules/openafs/src/config/Makefile.config Makefile.afs Makefile.common
env EXTRA_CFLAGS="" make -C /lib/modules/2.6.17-10-generic/build M=/usr/src/modules/openafs/src/libafs/MODLOAD-2.6.17-10-generic-MP modules
make[6]: Entering directory `/usr/src/linux-headers-2.6.17-10-generic'
  CC [M]  /usr/src/modules/openafs/src/libafs/MODLOAD-2.6.17-10-generic-MP/afs_atomlist.o
  CC [M]  /usr/src/modules/openafs/src/libafs/MODLOAD-2.6.17-10-generic-MP/afs_lhash.o
  CC [M]  /usr/src/modules/openafs/src/libafs/MODLOAD-2.6.17-10-generic-MP/afs_analyze.o
In file included from /usr/src/modules/openafs/src/afs/afs_osi.h:443,
                 from /usr/src/modules/openafs/src/rx/rx_clock.h:88,
                 from /usr/src/modules/openafs/src/rx/rx.h:35,
                 from /usr/src/modules/openafs/src/afs/afsincludes.h:26,
                 from /usr/src/modules/openafs/src/libafs/MODLOAD-2.6.17-10-generic-MP/afs_analyze.c:36:
/usr/src/modules/openafs/src/afs/LINUX/osi_machdep.h:55:2: error: #error Not sure what to do about rlim (should be in the Linux task struct somewhere....)
make[7]: *** [/usr/src/modules/openafs/src/libafs/MODLOAD-2.6.17-10-generic-MP/afs_analyze.o] Error 1
make[6]: *** [_module_/usr/src/modules/openafs/src/libafs/MODLOAD-2.6.17-10-generic-MP] Error 2
make[6]: Leaving directory `/usr/src/linux-headers-2.6.17-10-generic'
make[5]: *** [openafs.ko] Error 2
make[5]: Leaving directory `/usr/src/modules/openafs/src/libafs/MODLOAD-2.6.17-10-generic-MP'
make[4]: *** [linux_compdirs] Error 2
make[4]: Leaving directory `/usr/src/modules/openafs/src/libafs'
make[3]: *** [libafs] Error 2
make[3]: Leaving directory `/usr/src/modules/openafs'
make[2]: *** [build] Error 2
make[2]: Leaving directory `/usr/src/modules/openafs'
make[1]: *** [only_libafs] Error 2
make[1]: Leaving directory `/usr/src/modules/openafs'
make: *** [build-modules-stamp] Error 2
BUILD FAILED!
See /var/cache/modass/openafs-modules-source.buildlog.2.6.17-10-generic.1162424390 for details.
Build failed. Press Return to continue...