All pastes #231711 Raw Edit

Someone

public text v1 · immutable
#231711 ·published 2006-10-31 23:50 UTC
rendered paste body
rm /home/mrdocs/cvs/13/Scribus/scribus/*.moc


Building CXX object scribus/CMakeFiles/scribus.dir/insertaframe.o
/usr/bin/c++   -march=k8 -O0 -g -ftracer -pipe -Wall  -O0 -g3 -Wall -I/home/mrdocs/cvs/cmakescribus/scribus -I/home/mrdocs/cvs/13/Scribus/scribus -I/home/mrdocs/cvs/cmakescribus -I/usr/lib/qt3/include -I/usr/include/freetype2 -I/usr/include/libxml2 -I/usr/include/python2.4 -I/usr/local/include/cairo -I/home/mrdocs/cvs/13/Scribus   -DSHAREDIR=\"/opt/134cairo/share/scribus/\" -DDOCDIR=\"/opt/134cairo/share/doc/scribus/\" -DICONDIR=\"/opt/134cairo/share/scribus/icons/\" -DSAMPLESDIR=\"/opt/134cairo/share/scribus/samples/\" -DSCRIPTSDIR=\"/opt/134cairo/share/scribus/scripts/\" -DTEMPLATEDIR=\"/opt/134cairo/share/scribus/templates/\" -DLIBDIR=\"/opt/134cairo/lib/scribus/\" -DPLUGINDIR=\"/opt/134cairo/lib/scribus/plugins/\" -DQT_SHARED -DQT_NO_DEBUG -DQT_THREAD_SUPPORT -D_REENTRANT -DHAVE_DLFCN_H -DHAVE_UNISTD_H -DHAVE_CONFIG_H -o scribus/CMakeFiles/scribus.dir/insertaframe.o -c /home/mrdocs/cvs/13/Scribus/scribus/insertaframe.cpp
/home/mrdocs/cvs/13/Scribus/scribus/insertaframe.cpp: In constructor ‘InsertAFrame::InsertAFrame(QWidget*, ScribusDoc*)’:
/home/mrdocs/cvs/13/Scribus/scribus/insertaframe.cpp:43: error: ‘placementPagesRangeButton’ was not declared in this scope
/home/mrdocs/cvs/13/Scribus/scribus/insertaframe.cpp: In member function ‘void InsertAFrame::slotSelectPagePlacement(int)’:
/home/mrdocs/cvs/13/Scribus/scribus/insertaframe.cpp:124: error: ‘placementPagesRangeButton’ was not declared in this scope
make[2]: *** [scribus/CMakeFiles/scribus.dir/insertaframe.o] Error 1
make[2]: Leaving directory `/home/mrdocs/cvs/cmakescribus'
make[1]: *** [scribus/CMakeFiles/scribus.dir/all] Error 2
make[1]: Leaving directory `/home/mrdocs/cvs/cmakescribus'
make: *** [all] Error 2
mrdocs@linux:~/cvs/cmakescribus> rm