All pastes #230796 Raw Edit

Something

public text v1 · immutable
#230796 ·published 2006-10-31 13:01 UTC
rendered paste body
make
gcc -g -O2 -D_REENTRANT -D_THREAD_SAFE -D_THREAD_SAFE -D_REENTRANT -g -Wall -Wpointer-arith -Wconversion -DHAVE_CONFIG_H   -c -o main.o main.c
In file included from verify.h:5,
                 from main.c:63:
tailq.h:77:1: warning: "TAILQ_INIT" redefined
In file included from main.c:36:
/usr/include/sys/queue.h:125:1: warning: this is the location of the previous definition
In file included from verify.h:5,
                 from main.c:63:
tailq.h:82:1: warning: "TAILQ_INSERT_AFTER" redefined
In file included from main.c:36:
/usr/include/sys/queue.h:147:1: warning: this is the location of the previous definition
In file included from verify.h:5,
                 from main.c:63:
tailq.h:99:1: warning: "TAILQ_INSERT_HEAD" redefined
In file included from main.c:36:
/usr/include/sys/queue.h:130:1: warning: this is the location of the previous definition
In file included from verify.h:5,
                 from main.c:63:
tailq.h:109:1: warning: "TAILQ_INSERT_TAIL" redefined
In file included from main.c:36:
/usr/include/sys/queue.h:140:1: warning: this is the location of the previous definition
In file included from verify.h:5,
                 from main.c:63:
tailq.h:124:1: warning: "TAILQ_REMOVE" redefined
In file included from main.c:36:
/usr/include/sys/queue.h:157:1: warning: this is the location of the previous definition
main.c: In function `main':
main.c:493: warning: too many arguments for format
gcc -g -O2 -D_REENTRANT -D_THREAD_SAFE -D_THREAD_SAFE -D_REENTRANT -g -Wall -Wpointer-arith -Wconversion -DHAVE_CONFIG_H   -c -o mcom.o mcom.c
gcc -g -O2 -D_REENTRANT -D_THREAD_SAFE -D_THREAD_SAFE -D_REENTRANT -g -Wall -Wpointer-arith -Wconversion -DHAVE_CONFIG_H   -c -o verify.o verify.c
verify.c: In function `verify_init':
verify.c:225: warning: implicit declaration of function `errc'
verify.c:228: warning: implicit declaration of function `dbopen'
verify.c:228: warning: assignment makes pointer from integer without a cast
verify.c:231: warning: assignment makes pointer from integer without a cast
verify.c:238: warning: assignment makes pointer from integer without a cast
verify.c:241: warning: assignment makes pointer from integer without a cast
verify.c:250: warning: assignment makes pointer from integer without a cast
verify.c: In function `verify_address':
verify.c:308: warning: implicit declaration of function `asprintf'
verify.c:324: error: too few arguments to function
verify.c:325: warning: assignment makes pointer from integer without a cast
verify.c:328: warning: implicit declaration of function `flock'
verify.c:328: error: too few arguments to function
verify.c:332: warning: passing arg 2 of pointer to function from incompatible pointer type
verify.c:332: error: too few arguments to function
verify.c:374: warning: passing arg 2 of pointer to function from incompatible pointer type
verify.c:374: error: too few arguments to function
verify.c:430: warning: passing arg 2 of pointer to function from incompatible pointer type
verify.c:430: error: too few arguments to function
verify.c:572: warning: implicit declaration of function `strlcpy'
verify.c: In function `addrcache_flush_head':
verify.c:866: warning: passing arg 2 of pointer to function from incompatible pointer type
verify.c:866: error: too few arguments to function
verify.c:876: warning: passing arg 2 of pointer to function from incompatible pointer type
verify.c:876: error: too few arguments to function
verify.c: In function `addrcache_xadd_copy':
verify.c:920: error: `R_NOOVERWRITE' undeclared (first use in this function)
verify.c:920: error: (Each undeclared identifier is reported only once
verify.c:920: error: for each function it appears in.)
verify.c:920: warning: passing arg 2 of pointer to function from incompatible pointer type
verify.c:920: error: too few arguments to function
verify.c:941: error: structure has no member named `seq'
verify.c:942: error: `R_CURSOR' undeclared (first use in this function)
verify.c:963: warning: passing arg 2 of pointer to function from incompatible pointer type
verify.c:963: error: too few arguments to function
verify.c: In function `domcache_flush_head':
verify.c:1129: warning: passing arg 2 of pointer to function from incompatible pointer type
verify.c:1129: error: too few arguments to function
verify.c:1140: warning: passing arg 2 of pointer to function from incompatible pointer type
verify.c:1140: error: too few arguments to function
verify.c: In function `domcache_xadd_copy':
verify.c:1176: error: `R_NOOVERWRITE' undeclared (first use in this function)
verify.c:1176: warning: passing arg 2 of pointer to function from incompatible pointer type
verify.c:1176: error: too few arguments to function
verify.c:1191: error: structure has no member named `seq'
verify.c:1192: error: `R_CURSOR' undeclared (first use in this function)
verify.c:1212: warning: passing arg 2 of pointer to function from incompatible pointer type
verify.c:1212: error: too few arguments to function
verify.c: In function `lookup_mx':
verify.c:1252: warning: passing arg 2 of pointer to function from incompatible pointer type
verify.c:1252: error: too few arguments to function
verify.c: In function `lookup_ip':
verify.c:1485: warning: passing arg 2 of pointer to function from incompatible pointer type
verify.c:1485: error: too few arguments to function
verify.c: In function `extmap_xlock':
verify.c:1857: error: too few arguments to function
verify.c: In function `extmap_unlock':
verify.c:1866: error: too few arguments to function
make: *** [verify.o] Ошибка 1