NOTE: make -e MAKEFLAGS= KERNEL_PATH=/home/UKB01/graeme.gregory/zaurus/build-gcc/tmp/staging/arm-linux/kernel KERNEL_SRC=/home/UKB01/graeme.gregory/zaurus/build-gcc/tmp/staging/arm-linux/kernel KERNEL_VERSION=2.6.13-mm3 CC=arm-linux-gcc LD=arm-linux-ld KERNEL_PATH=/home/UKB01/graeme.gregory/zaurus/build-gcc/tmp/staging/arm-linux/kernel MAKE=make -e
make -e -C /home/UKB01/graeme.gregory/zaurus/build-gcc/tmp/staging/arm-linux/kernel SUBDIRS=/home/UKB01/graeme.gregory/zaurus/build-gcc/tmp/work/hostap-modules-0.4.4-r0/hostap-driver-0.4.4/driver/modules \
MODVERDIR=/home/UKB01/graeme.gregory/zaurus/build-gcc/tmp/work/hostap-modules-0.4.4-r0/hostap-driver-0.4.4/driver/modules modules
make[1]: Entering directory `/home/UKB01/graeme.gregory/zaurus/build-gcc/tmp/staging/arm-linux/kernel'
make[2]: Entering directory `/home/UKB01/graeme.gregory/zaurus/build-gcc/tmp/staging/arm-linux/kernel'
CC [M] /home/UKB01/graeme.gregory/zaurus/build-gcc/tmp/work/hostap-modules-0.4.4-r0/hostap-driver-0.4.4/driver/modules/hostap.o
CC [M] /home/UKB01/graeme.gregory/zaurus/build-gcc/tmp/work/hostap-modules-0.4.4-r0/hostap-driver-0.4.4/driver/modules/hostap_crypt_wep.o
CC [M] /home/UKB01/graeme.gregory/zaurus/build-gcc/tmp/work/hostap-modules-0.4.4-r0/hostap-driver-0.4.4/driver/modules/hostap_crypt_tkip.o
CC [M] /home/UKB01/graeme.gregory/zaurus/build-gcc/tmp/work/hostap-modules-0.4.4-r0/hostap-driver-0.4.4/driver/modules/hostap_crypt_ccmp.o
CC [M] /home/UKB01/graeme.gregory/zaurus/build-gcc/tmp/work/hostap-modules-0.
4.4-r0/hostap-driver-0.4.4/driver/modules/hostap_cs.o
/home/UKB01/graeme.gregory/zaurus/build-gcc/tmp/work/hostap-modules-0.4.4-r0/hostap-driver-0.4.4/driver/modules/hostap_cs.c: In function `prism2_attach':
/home/UKB01/graeme.gregory/zaurus/build-gcc/tmp/work/hostap-modules-0.4.4-r0/hostap-driver-0.4.4/driver/modules/hostap_cs.c:544: warning: implicit declaration of function `pcmcia_register_client'
/home/UKB01/graeme.gregory/zaurus/build-gcc/tmp/work/hostap-modules-0.4.4-r0/hostap-driver-0.4.4/driver/modules/hostap_cs.c: In function `prism2_detach':
/home/UKB01/graeme.gregory/zaurus/build-gcc/tmp/work/hostap-modules-0.4.4-r0/hostap-driver-0.4.4/driver/modules/hostap_cs.c:574: warning: implicit declaration of function `pcmcia_deregister_client'
/home/UKB01/graeme.gregory/zaurus/build-gcc/tmp/work/hostap-modules-0.4.4-r0/hostap-driver-0.4.4/driver/modules/hostap_cs.c: At top level:
/home/UKB01/graeme.gregory/zaurus/build-gcc/tmp/work/hostap-modules-0.4.4-r0/hostap-driver-0.4.4/driver/modules/hostap_cs.c:986: error: unknown field `attach' specified in initializer
/home/UKB01/graeme.gregory/zaurus/build-gcc/tmp/work/hostap-modules-0.4.4-r0/hostap-driver-0.4.4/driver/modules/hostap_cs.c:986: warning: excess elements in struct initializer
/home/UKB01/graeme.gregory/zaurus/build-gcc/tmp/work/hostap-modules-0.4.4-r0/hostap-driver-0.4.4/driver/modules/hostap_cs.c:986: warning: (near initialization for `hostap_driver')
/home/UKB01/graeme.gregory/zaurus/build-gcc/tmp/work/hostap-modules-0.4.4-r0/hostap-driver-0.4.4/driver/modules/hostap_cs.c:987: error: unknown field `detach' specified in initializer
/home/UKB01/graeme.gregory/zaurus/build-gcc/tmp/work/hostap-modules-0.4.4-r0/hostap-driver-0.4.4/driver/modules/hostap_cs.c:987: warning: excess elements in struct initializer
/home/UKB01/graeme.gregory/zaurus/build-gcc/tmp/work/hostap-modules-0.4.4-r0/hostap-driver-0.4.4/driver/modules/hostap_cs.c:987: warning: (near initialization for `hostap_driver')
/home/UKB01/graeme.gregory/zaurus/build-gcc/tmp/work/hostap-modules-0.4.4-r0/hostap-driver-0.4.4/driver/modules/hostap_cs.c:990: error: unknown field `event' specified in initializer
/home/UKB01/graeme.gregory/zaurus/build-gcc/tmp/work/hostap-modules-0.4.4-r0/hostap-driver-0.4.4/driver/modules/hostap_cs.c:990: warning: initialization from incompatible pointer type
make[2]: *** [/home/UKB01/graeme.gregory/zaurus/build-gcc/tmp/work/hostap-modules-0.4.4-r0/hostap-driver-0.4.4/driver/modules/hostap_cs.o] Error 1
make[2]: Leaving directory `/home/UKB01/graeme.gregory/zaurus/build-gcc/tmp/staging/arm-linux/kernel'
make[1]: *** [_module_/home/UKB01/graeme.gregory/zaurus/build-gcc/tmp/work/hostap-modules-0.4.4-r0/hostap-driver-0.4.4/driver/modules] Error 2
make[1]: Leaving directory `/home/UKB01/graeme.gregory/zaurus/build-gcc/tmp/staging/arm-linux/kernel'
make: *** [2.6] Error 2