rendered paste bodyis/projects/cl-linux/build/tmp/work/glibc-2.3.5+cvs20050627-r0/build-i386-oe-linux/elf/ld.so
| /home/chris/projects/cl-linux/build/tmp/work/glibc-2.3.5+cvs20050627-r0/build-i386-oe-linux/linuxthreads/libpthread_pic.a(pthread.os): In function `pthread_initialize':
| /home/chris/projects/cl-linux/build/tmp/work/glibc-2.3.5+cvs20050627-r0/libc/linuxthreads/pthread.c:550: undefined reference to `_res'
| /home/chris/projects/cl-linux/build/tmp/work/glibc-2.3.5+cvs20050627-r0/build-i386-oe-linux/linuxthreads/libpthread_pic.a(pthread.os): In function `__pthread_reset_main_thread':
| /home/chris/projects/cl-linux/build/tmp/work/glibc-2.3.5+cvs20050627-r0/libc/linuxthreads/pthread.c:1146: undefined reference to `_errno'
| /home/chris/projects/cl-linux/build/tmp/work/glibc-2.3.5+cvs20050627-r0/libc/linuxthreads/pthread.c:1147: undefined reference to `_h_errno'
| /home/chris/projects/cl-linux/build/tmp/work/glibc-2.3.5+cvs20050627-r0/libc/linuxthreads/pthread.c:1148: undefined reference to `_res'
| /home/chris/projects/cl-linux/build/tmp/work/glibc-2.3.5+cvs20050627-r0/build-i386-oe-linux/linuxthreads/libpthread_pic.a(pthread.os):(.data.rel+0x1b8): undefined reference to `_errno'
| /home/chris/projects/cl-linux/build/tmp/work/glibc-2.3.5+cvs20050627-r0/build-i386-oe-linux/linuxthreads/libpthread_pic.a(pthread.os):(.data.rel+0x1c0): undefined reference to `_h_errno'
| /home/chris/projects/cl-linux/build/tmp/work/glibc-2.3.5+cvs20050627-r0/build-i386-oe-linux/linuxthreads/libpthread_pic.a(pthread.os):(.data.rel+0x1c8): undefined reference to `_res'
| collect2: ld returned 1 exit status
| make[2]: *** [/home/chris/projects/cl-linux/build/tmp/work/glibc-2.3.5+cvs20050627-r0/build-i386-oe-linux/linuxthreads/libpthread.so] Fehler 1
| make[2]: Leaving directory `/home/chris/projects/cl-linux/build/tmp/work/glibc-2.3.5+cvs20050627-r0/libc/linuxthreads'
| make[1]: *** [linuxthreads/others] Fehler 2
| make[1]: Leaving directory `/home/chris/projects/cl-linux/build/tmp/work/glibc-2.3.5+cvs20050627-r0/libc'
| make: *** [all] Fehler 2
| FATAL: oe_runmake failed
NOTE: Task failed: /home/chris/projects/cl-linux/build/tmp/work/glibc-2.3.5+cvs20050627-r0/temp/log.do_compile.22050
NOTE: package glibc-2.3.5+cvs20050627-r0: task do_compile: failed
ERROR: TaskFailed event exception, aborting
NOTE: package glibc-2.3.5+cvs20050627: failed
ERROR: Build of glibc failed
chris@linux:~/projects/cl-linux/build>