All pastes #229770 Raw Edit

Unnamed

public text v1 · immutable
#229770 ·published 2006-10-30 22:39 UTC
rendered paste body
  CC [M]  drivers/net/wireless/d80211/bcm43xx/bcm43xx_main.o
In file included from drivers/net/wireless/d80211/bcm43xx/bcm43xx_main.c:44:
drivers/net/wireless/d80211/bcm43xx/bcm43xx.h:22:24: error: bcm43xx_lo.h: No such file or directory
drivers/net/wireless/d80211/bcm43xx/bcm43xx.h:24:28: error: bcm43xx_vstack.h: No such file or directory
In file included from drivers/net/wireless/d80211/bcm43xx/bcm43xx_main.c:44:
drivers/net/wireless/d80211/bcm43xx/bcm43xx.h:765: error: field 'genstack' has incomplete type
drivers/net/wireless/d80211/bcm43xx/bcm43xx_main.c: In function 'bcm43xx_periodic_every120sec':
drivers/net/wireless/d80211/bcm43xx/bcm43xx_main.c:2481: warning: implicit declaration of function 'bcm43xx_lo_g_measure'
drivers/net/wireless/d80211/bcm43xx/bcm43xx_main.c: In function 'bcm43xx_periodic_every60sec':
drivers/net/wireless/d80211/bcm43xx/bcm43xx_main.c:2487: warning: implicit declaration of function 'bcm43xx_loctl_mark_all_unused'
drivers/net/wireless/d80211/bcm43xx/bcm43xx_main.c: In function 'prepare_phydata_for_init':
drivers/net/wireless/d80211/bcm43xx/bcm43xx_main.c:3003: error: dereferencing pointer to incomplete type
drivers/net/wireless/d80211/bcm43xx/bcm43xx_main.c:3004: error: dereferencing pointer to incomplete type
drivers/net/wireless/d80211/bcm43xx/bcm43xx_main.c: In function 'bcm43xx_read_phyinfo':
drivers/net/wireless/d80211/bcm43xx/bcm43xx_main.c:3324: error: dereferencing pointer to incomplete type
drivers/net/wireless/d80211/bcm43xx/bcm43xx_main.c: In function 'bcm43xx_init_one':
drivers/net/wireless/d80211/bcm43xx/bcm43xx_main.c:4012: warning: implicit declaration of function 'bcm43xx_vstack_alloc'
drivers/net/wireless/d80211/bcm43xx/bcm43xx_main.c:4037: warning: implicit declaration of function 'bcm43xx_vstack_free'
make[5]: *** [drivers/net/wireless/d80211/bcm43xx/bcm43xx_main.o] Error 1
make[4]: *** [drivers/net/wireless/d80211/bcm43xx] Error 2
make[3]: *** [drivers/net/wireless/d80211] Error 2
make[2]: *** [drivers/net/wireless] Error 2
make[1]: *** [drivers/net] Error 2
make: *** [drivers] Error 2