All pastes #22938 Raw Edit

Stuff

public text v1 · immutable
#22938 ·published 2005-09-14 21:09 UTC
rendered paste body
--- C++ prelinker: /usr/people/cwant/blender/bf-blender/blender/obj/irix-6.5-mips/intern/iksolver/IK_QJacobian.o ---
 CC -DEFAULT:abi=n32:isa=mips4:proc=r10k -DEFAULT:abi=n32:isa=mips4:proc=r10k -c -DUSE_SUMO_SOLID -n32 -mips3 -Xcpluscomm -LANG:std -LANG:libc_in_namespace_std=off -DNDEBUG -n32 -mips3 -O2 -OPT:Olimit=0 -fullwarn -woff 1209,1424,3201 -I/usr/people/cwant/blender/bf-blender/blender/../lib/irix-6.5-mips/moto/include -I/usr/people/cwant/blender/bf-blender/blender/../lib/irix-6.5-mips/memutil/include IK_QJacobian.cpp -o /usr/people/cwant/blender/bf-blender/blender/obj/irix-6.5-mips/intern/iksolver/IK_QJacobian.o
cc-3625 CC: REMARK File = /usr/include/sys/select.h, Line = 35
  an include directive is appearing within the scope of extern "C"

  #include <standards.h>
   ^
cc-3625 CC: REMARK File = /usr/include/sys/select.h, Line = 35
  an include directive is appearing within the scope of extern "C"

  #include <standards.h>
                        ^
cc-3625 CC: REMARK File = /usr/include/sys/select.h, Line = 80
  an include directive is appearing within the scope of extern "C"

  #include <string.h>
   ^
cc-3625 CC: REMARK File = /usr/include/sys/select.h, Line = 80
  an include directive is appearing within the scope of extern "C"

  #include <string.h>
                     ^
cc-3625 CC: REMARK File = /usr/include/string.h, Line = 4
  an include directive is appearing within the scope of extern "C"

  #include <internal/string_core.h>
   ^
cc-3625 CC: REMARK File = /usr/include/string.h, Line = 4
  an include directive is appearing within the scope of extern "C"

  #include <internal/string_core.h>
                                   ^
cc-3625 CC: REMARK File = /usr/include/internal/string_core.h, Line = 35
  an include directive is appearing within the scope of extern "C"

  #include <standards.h>
   ^
cc-3625 CC: REMARK File = /usr/include/internal/string_core.h, Line = 35
  an include directive is appearing within the scope of extern "C"

  #include <standards.h>
                        ^
cc-3625 CC: REMARK File = /usr/include/internal/string_core.h, Line = 36
  an include directive is appearing within the scope of extern "C"

  #include <internal/sgimacros.h>
   ^
cc-3625 CC: REMARK File = /usr/include/internal/string_core.h, Line = 36
  an include directive is appearing within the scope of extern "C"

  #include <internal/sgimacros.h>
                                 ^
cc-3625 CC: REMARK File = /usr/include/CC/c_locale.h, Line = 19
  an include directive is appearing within the scope of extern "C"

  #include <sgidefs.h>
   ^
cc-3625 CC: REMARK File = /usr/include/CC/c_locale.h, Line = 19
  an include directive is appearing within the scope of extern "C"

  #include <sgidefs.h>
                      ^
cc-3625 CC: REMARK File = /usr/include/CC/c_locale.h, Line = 20
  an include directive is appearing within the scope of extern "C"

  #include <standards.h>
   ^
cc-3625 CC: REMARK File = /usr/include/CC/c_locale.h, Line = 20
  an include directive is appearing within the scope of extern "C"

  #include <standards.h>
                        ^
cc-3303 CC: WARNING File = TNT/vec.h, Line = 157
  A type qualifier on a return type is meaningless.

      const iterator begin() const { return v_;}
                     ^
cc-3303 CC: WARNING File = TNT/vec.h, Line = 158
  A type qualifier on a return type is meaningless.

      const iterator end() const  { return v_ + n_; }
                     ^
cc-3303 CC: REMARK File = TNT/vec.h, Line = 157
  A type qualifier on a return type is meaningless.

      const iterator begin() const { return v_;}
                     ^
          detected during instantiation of class "TNT::Vector<MT_Scalar>" at                    line 86 of "IK_QJacobian.h"cc-3303 CC: REMARK File = TNT/vec.h, Line = 158
  A type qualifier on a return type is meaningless.

      const iterator end() const  { return v_ + n_; }
                     ^
          detected during instantiation of class "TNT::Vector<MT_Scalar>" at                    line 86 of "IK_QJacobian.h"cc-1282 CC: ERROR File = TNT/svd.h, Line = 235
  More than one instance of overloaded function "abs" matches the argument list.

            Function symbol function "abs(double)" is ambiguous by inheritance.            Function symbol function "TNT::abs(double)" is ambiguous by                      inheritance.            The argument types are:  (MT_Scalar).  			if (abs(e[k]) <= eps*(abs(s[k]) + abs(s[k+1]))) {
  			    ^
          detected during instantiation of "void                    TNT::SVD(IK_QJacobian::TMatrix &, IK_QJacobian::TMatrix &,                    IK_QJacobian::TVector &, IK_QJacobian::TMatrix &,                    IK_QJacobian::TVector &, IK_QJacobian::TVector &)" cc-1282 CC: ERROR File = TNT/svd.h, Line = 235
  More than one instance of overloaded function "abs" matches the argument list.

            Function symbol function "abs(double)" is ambiguous by inheritance.            Function symbol function "TNT::abs(double)" is ambiguous by
                      inheritance.
            The argument types are:  (MT_Scalar).
  			if (abs(e[k]) <= eps*(abs(s[k]) + abs(s[k+1]))) {
  			                      ^
          detected during instantiation of "void
                    TNT::SVD(IK_QJacobian::TMatrix &, IK_QJacobian::TMatrix &,
                    IK_QJacobian::TVector &, IK_QJacobian::TMatrix &,
                    IK_QJacobian::TVector &, IK_QJacobian::TVector &)" 

cc-1282 CC: ERROR File = TNT/svd.h, Line = 235
  More than one instance of overloaded function "abs" matches the argument list.

            Function symbol function "abs(double)" is ambiguous by inheritance.
            Function symbol function "TNT::abs(double)" is ambiguous by
                      inheritance.
            The argument types are:  (MT_Scalar).
  			if (abs(e[k]) <= eps*(abs(s[k]) + abs(s[k+1]))) {
  			                                  ^
          detected during instantiation of "void
                    TNT::SVD(IK_QJacobian::TMatrix &, IK_QJacobian::TMatrix &,
                    IK_QJacobian::TVector &, IK_QJacobian::TMatrix &,
                    IK_QJacobian::TVector &, IK_QJacobian::TVector &)" 

cc-1282 CC: ERROR File = TNT/svd.h, Line = 248
  More than one instance of overloaded function "abs" matches the argument list.

            Function symbol function "abs(double)" is ambiguous by inheritance.
            Function symbol function "TNT::abs(double)" is ambiguous by
                      inheritance.
            The argument types are:  (MT_Scalar).
  				typename MaTRiX::value_type t = (ks != p ? abs(e[ks]) : 0.) + 
  				                                           ^
          detected during instantiation of "void
                    TNT::SVD(IK_QJacobian::TMatrix &, IK_QJacobian::TMatrix &,
                    IK_QJacobian::TVector &, IK_QJacobian::TMatrix &,
                    IK_QJacobian::TVector &, IK_QJacobian::TVector &)" 

cc-1282 CC: ERROR File = TNT/svd.h, Line = 249
  More than one instance of overloaded function "abs" matches the argument list.

            Function symbol function "abs(double)" is ambiguous by inheritance.
            Function symbol function "TNT::abs(double)" is ambiguous by
                      inheritance.
            The argument types are:  (MT_Scalar).
  							  (ks != k+1 ? abs(e[ks-1]) : 0.);
  							               ^
          detected during instantiation of "void
                    TNT::SVD(IK_QJacobian::TMatrix &, IK_QJacobian::TMatrix &,
                    IK_QJacobian::TVector &, IK_QJacobian::TMatrix &,
                    IK_QJacobian::TVector &, IK_QJacobian::TVector &)" 

cc-1282 CC: ERROR File = TNT/svd.h, Line = 250
  More than one instance of overloaded function "abs" matches the argument list.

            Function symbol function "abs(double)" is ambiguous by inheritance.
            Function symbol function "TNT::abs(double)" is ambiguous by
                      inheritance.
            The argument types are:  (MT_Scalar).
  				if (abs(s[ks]) <= eps*t)  {
  				    ^
          detected during instantiation of "void
                    TNT::SVD(IK_QJacobian::TMatrix &, IK_QJacobian::TMatrix &,
                    IK_QJacobian::TVector &, IK_QJacobian::TMatrix &,
                    IK_QJacobian::TVector &, IK_QJacobian::TVector &)" 

cc-1282 CC: ERROR File = TNT/svd.h, Line = 323
  More than one instance of overloaded function "abs" matches the argument list.

            Function symbol function "abs(double)" is ambiguous by inheritance.
            Function symbol function "TNT::abs(double)" is ambiguous by
                      inheritance.
            The argument types are:  (MT_Scalar).
  						  abs(s[p-1]),abs(s[p-2])),abs(e[p-2])), 
  						  ^
          detected during instantiation of "void
                    TNT::SVD(IK_QJacobian::TMatrix &, IK_QJacobian::TMatrix &,
                    IK_QJacobian::TVector &, IK_QJacobian::TMatrix &,
                    IK_QJacobian::TVector &, IK_QJacobian::TVector &)" 

cc-1282 CC: ERROR File = TNT/svd.h, Line = 323
  More than one instance of overloaded function "abs" matches the argument list.

            Function symbol function "abs(double)" is ambiguous by inheritance.
            Function symbol function "TNT::abs(double)" is ambiguous by
                      inheritance.
            The argument types are:  (MT_Scalar).
  						  abs(s[p-1]),abs(s[p-2])),abs(e[p-2])), 
  						              ^
          detected during instantiation of "void
                    TNT::SVD(IK_QJacobian::TMatrix &, IK_QJacobian::TMatrix &,
                    IK_QJacobian::TVector &, IK_QJacobian::TMatrix &,
                    IK_QJacobian::TVector &, IK_QJacobian::TVector &)" 

cc-1282 CC: ERROR File = TNT/svd.h, Line = 323
  More than one instance of overloaded function "abs" matches the argument list.

            Function symbol function "abs(double)" is ambiguous by inheritance.
            Function symbol function "TNT::abs(double)" is ambiguous by
                      inheritance.
            The argument types are:  (MT_Scalar).
  						  abs(s[p-1]),abs(s[p-2])),abs(e[p-2])), 
  						                           ^
          detected during instantiation of "void
                    TNT::SVD(IK_QJacobian::TMatrix &, IK_QJacobian::TMatrix &,
                    IK_QJacobian::TVector &, IK_QJacobian::TMatrix &,
                    IK_QJacobian::TVector &, IK_QJacobian::TVector &)" 

cc-1282 CC: ERROR File = TNT/svd.h, Line = 324
  More than one instance of overloaded function "abs" matches the argument list.

            Function symbol function "abs(double)" is ambiguous by inheritance.
            Function symbol function "TNT::abs(double)" is ambiguous by
                      inheritance.
            The argument types are:  (MT_Scalar).
  						  abs(s[k])),abs(e[k]));
  						  ^
          detected during instantiation of "void
                    TNT::SVD(IK_QJacobian::TMatrix &, IK_QJacobian::TMatrix &,
                    IK_QJacobian::TVector &, IK_QJacobian::TMatrix &,
                    IK_QJacobian::TVector &, IK_QJacobian::TVector &)" 

cc-1282 CC: ERROR File = TNT/svd.h, Line = 324
  More than one instance of overloaded function "abs" matches the argument list.

            Function symbol function "abs(double)" is ambiguous by inheritance.
            Function symbol function "TNT::abs(double)" is ambiguous by
                      inheritance.
            The argument types are:  (MT_Scalar).
  						  abs(s[k])),abs(e[k]));
  						             ^
          detected during instantiation of "void
                    TNT::SVD(IK_QJacobian::TMatrix &, IK_QJacobian::TMatrix &,
                    IK_QJacobian::TVector &, IK_QJacobian::TMatrix &,
                    IK_QJacobian::TVector &, IK_QJacobian::TVector &)" 

11 errors detected in the compilation of "IK_QJacobian.cpp".
C++ prelinker: Error compiling /usr/people/cwant/blender/bf-blender/blender/obj/irix-6.5-mips/intern/iksolver/IK_QJacobian.o
gmake[3]: *** [/usr/people/cwant/blender/bf-blender/blender/obj/irix-6.5-mips/intern/iksolver/libiksolver.a] Error 2
gmake[2]: *** [all] Error 1
gmake[1]: *** [all] Error 1
gmake: *** [all] Error 1