apoc@apoc-desktop:~/eth-svn$ make clean all
rm -rf libETH.so aimbot.o backtrace.o commands.o drawtools.o engine.o eth.o g_functions.o hook.o hud.o medias.o medicbot.o menu.o net.o spycam.o visuals.o windows.o ghf eth.pk3 sdk \
pk3/scripts/eth.shader shaders.h q_math.o private.o
mkdir sdk
/bin/sh et-linux-2.60-sdk.x86.run --tar xfC sdk
find sdk -not -name "q_math.c" -not -iname "*.h" -exec rm -f {} \; 2> /dev/null || /bin/true
find sdk -type d -exec rmdir -p {} \; 2> /dev/null || /bin/true
rm -rf sdk/src/botai
sed -i -e "s/Window/eth_Window/" sdk/src/ui/ui_shared.h
sed -i -e "s/DT_NUM/eth_DT_NUM/" sdk/src/game/q_shared.h
sed -i -e "s/EV_NONE/eth_EV_NONE/" sdk/src/game/bg_public.h
tar xzf ghf-0.5-1.tar.gz
make -C ghf clean all
make[1]: Betrete Verzeichnis '/home/apoc/eth-svn/ghf'
rm -rf asm.o elf.o utils.o vfunction.o libghf.a ghf-test.o ghf-test ghf-0.5-1.tar.gz ghf
cc -Wall -pipe -march=i686 -I/usr/include/libelf -ggdb -c -o asm.o asm.c
asm.c:4:21: error: dis-asm.h: No such file or directory
asm.c:20: error: expected ) before from
asm.c:25: error: expected declaration specifiers or ... before bfd_vma
asm.c:25: warning: struct disassemble_info declared inside parameter list
asm.c:25: warning: its scope is only this definition or declaration, which is probably not what you want
asm.c: In function my_perror_memory:
asm.c:26: error: dereferencing pointer to incomplete type
asm.c:26: error: dereferencing pointer to incomplete type
asm.c: At top level:
asm.c:31: error: expected =, ,, ;, asm or __attribute__ before my_fprintf
asm.c: In function disassemble_x86:
asm.c:38: error: disassemble_info undeclared (first use in this function)
asm.c:38: error: (Each undeclared identifier is reported only once
asm.c:38: error: for each function it appears in.)
asm.c:38: error: expected ; before info
asm.c:39: warning: implicit declaration of function init_disassemble_info
asm.c:39: error: info undeclared (first use in this function)
asm.c:39: error: stdout undeclared (first use in this function)
asm.c:39: error: fprintf_ftype undeclared (first use in this function)
asm.c:39: error: expected ) before my_fprintf
asm.c:40: error: bfd_mach_i386_i386 undeclared (first use in this function)
asm.c:41: error: my_buffer_read_memory undeclared (first use in this function)
asm.c:45: warning: implicit declaration of function print_insn_i386
asm.c:45: error: bfd_vma undeclared (first use in this function)
asm.c:45: error: expected expression before ptr_size_t
asm.c:45: error: expected ) before addr
asm.c: In function detourFunction:
asm.c:57: warning: implicit declaration of function printf
asm.c:57: warning: incompatible implicit declaration of built-in function printf
make[1]: *** [asm.o] Fehler 1
make[1]: Verlasse Verzeichnis '/home/apoc/eth-svn/ghf'
make: *** [ghf/libghf.a] Fehler 2