All pastes #227528 Raw Edit

Someone

public text v1 · immutable
#227528 ·published 2006-10-29 09:42 UTC
rendered paste body
ERROR: function do_compile failed
ERROR: log data follows (/opt/OE/build/tmp/work/i486-angstrom-linux/rxvt-unicode-7.9-r0/temp/log.do_compile.6015)
| NOTE: make
| make[1]: Entering directory `/opt/OE/build/tmp/work/i486-angstrom-linux/rxvt-unicode-7.9-r0/rxvt-unicode-7.9/src'
| ccache i486-angstrom-linux-g++ -DHAVE_CONFIG_H  -isystem/opt/OE/build/tmp/staging/i486-angstrom-linux/include -I/opt/OE/build/tmp/staging/i486-angstrom-linux/include -I/opt/OE/build/tmp/staging/i486-angstrom-linux/include/freetype2   -DHAVE_LIBXPM -isystem/opt/OE/build/tmp/staging/i486-angstrom-linux/include -fexpensive-optimizations -fomit-frame-pointer -frename-registers -Os -fpermissive -fvisibility-inlines-hidden  -DDEBUG_STRICT  -I/opt/OE/build/tmp/staging/i486-angstrom-linux/include -I.. -I/opt/OE/build/tmp/work/i486-angstrom-linux/rxvt-unicode-7.9-r0/rxvt-unicode-7.9/src -I. -c rxvt.C
| In file included from rxvt.h:4,
|                  from rxvt.C:24:
| rxvtlib.h:51:2: error: #error set intp_t
| rxvtlib.h:53:2: error: #error set u_intp_t
| make[1]: *** [rxvt.o] Error 1
| make[1]: Leaving directory `/opt/OE/build/tmp/work/i486-angstrom-linux/rxvt-unicode-7.9-r0/rxvt-unicode-7.9/src'
| make: *** [all] Error 1
| FATAL: oe_runmake failed
NOTE: Task failed: /opt/OE/build/tmp/work/i486-angstrom-linux/rxvt-unicode-7.9-r0/temp/log.do_compile.6015
NOTE: package rxvt-unicode-7.9-r0: task do_compile: failed