rendered paste bodyThis file contains any messages produced by compilers while
running configure, to aid debugging if configure makes a mistake.
configure:2162: checking for Cygwin environment
configure:2178: cc -c conftest.c 1>&5
configure: In function 'main':
configure:2174: error: '__CYGWIN32__' undeclared (first use in this function)
configure:2174: error: (Each undeclared identifier is reported only once
configure:2174: error: for each function it appears in.)
configure: failed program was:
#line 2167 "configure"
#include "confdefs.h"
int main() {
#ifndef __CYGWIN__
#define __CYGWIN__ __CYGWIN32__
#endif
return __CYGWIN__;
; return 0; }
configure:2195: checking for mingw32 environment
configure:2207: cc -c conftest.c 1>&5
configure: In function 'main':
configure:2203: error: '__MINGW32__' undeclared (first use in this function)
configure:2203: error: (Each undeclared identifier is reported only once
configure:2203: error: for each function it appears in.)
configure: failed program was:
#line 2200 "configure"
#include "confdefs.h"
int main() {
return __MINGW32__;
; return 0; }
configure:2226: checking for egrep
configure:2241: checking for a sed that does not truncate output
configure:2361: checking host system type
configure:2382: checking target system type
configure:2480: checking for gcc
configure:2593: checking whether the C compiler (gcc ) works
configure:2609: gcc -o conftest conftest.c 1>&5
configure:2635: checking whether the C compiler (gcc ) is a cross-compiler
configure:2640: checking whether we are using GNU C
configure:2649: gcc -E conftest.c
configure:2668: checking whether gcc accepts -g
configure:2701: checking whether gcc and cc understand -c and -o together
configure:2716: gcc -c conftest.c -o conftest.o 1>&5
configure:2717: gcc -c conftest.c -o conftest.o 1>&5
configure:2722: cc -c conftest.c 1>&5
configure:2724: cc -c conftest.c -o conftest.o 1>&5
configure:2725: cc -c conftest.c -o conftest.o 1>&5
configure:2752: checking how to run the C preprocessor
configure:2773: gcc -E conftest.c >/dev/null 2>conftest.out
configure:2832: checking for AIX
configure:2856: checking whether ln -s works
configure:2888: checking if compiler supports -R
configure:2903: gcc -o conftest -g -O2 conftest.c -R /usr/lib 1>&5
powerpc-apple-darwin8-gcc-4.0.1: unrecognized option '-R'
/usr/bin/ld: can't map file: /usr/lib ((os/kern) invalid argument)
collect2: ld returned 1 exit status
configure: failed program was:
#line 2896 "configure"
#include "confdefs.h"
int main() {
; return 0; }
configure:2921: checking if compiler supports -Wl,-rpath,
configure:2936: gcc -o conftest -g -O2 conftest.c -Wl,-rpath,/usr/lib 1>&5
/usr/bin/ld: unknown flag: -rpath
collect2: ld returned 1 exit status
configure: failed program was:
#line 2929 "configure"
#include "confdefs.h"
int main() {
; return 0; }
configure:2962: checking for re2c
configure:3022: checking for gawk
configure:3022: checking for nawk
configure:3022: checking for awk
configure:3063: checking if awk is broken
configure:3082: checking for bison
configure:3122: checking for bison version
configure:3163: checking for flex
configure:3197: checking for yywrap in -lfl
configure:3216: gcc -o conftest -g -O2 conftest.c -lfl 1>&5
configure:3240: checking lex output file root
configure:3261: checking whether yytext is a pointer
configure:3280: gcc -o conftest -g -O2 conftest.c -lfl 1>&5
configure:3304: checking for working const
configure:3358: gcc -c -g -O2 conftest.c 1>&5
configure:3384: checking for flex version
configure:3607: checking whether to force non-PIC code in shared modules
configure:3703: gcc -o conftest -g -O2 -no-cpp-precomp conftest.c 1>&5
configure:3723: checking for pthreads_cflags
configure:3793: checking for pthreads_lib
configure:3942: checking for AOLserver support
configure:4185: checking for Apache 1.x module support via DSO through APXS
configure:4490: checking for Apache 1.x module support
configure:5333: checking for mod_charset compatibility option
configure:5470: checking for Apache 2.0 filter-module support via DSO through APXS
configure:6300: checking for Apache 2.0 handler-module support via DSO through APXS
configure:7131: checking for Apache 1.x (hooks) module support via DSO through APXS
configure:7436: checking for Apache 1.x (hooks) module support
configure:8279: checking for mod_charset compatibility option
configure:8417: checking for Caudium support
configure:8749: checking for CLI build
configure:8807: checking for Continuity support
configure:9054: checking for embedded SAPI library support
configure:9277: checking for Zeus ISAPI support
configure:9509: checking for Milter support
configure:9784: checking for NSAPI support
configure:10127: checking for PHTTPD support
configure:10358: checking for Pi3Web support
configure:10689: checking for Roxen/Pike support
configure:11200: checking for thttpd
configure:11428: checking for TUX
configure:11664: checking for webjames
configure:12085: checking for chosen SAPI module
configure:12992: checking for sendmail
configure:13037: checking whether system uses EBCDIC
configure:13056: gcc -o conftest -g -O2 -no-cpp-precomp conftest.c 1>&5
configure: failed program was:
#line 13048 "configure"
#include "confdefs.h"
int main(void) {
return (unsigned char)'A' != (unsigned char)0xC1;
}
configure:13084: checking whether byte ordering is bigendian
configure:13110: gcc -o conftest -g -O2 -no-cpp-precomp conftest.c 1>&5
configure:13181: checking for socket
configure:13209: gcc -o conftest -g -O2 -no-cpp-precomp conftest.c 1>&5
configure:13438: checking for socketpair
configure:13466: gcc -o conftest -g -O2 -no-cpp-precomp conftest.c 1>&5
configure:13695: checking for htonl
configure:13723: gcc -o conftest -g -O2 -no-cpp-precomp conftest.c 1>&5
configure:13952: checking for gethostname
configure:13980: gcc -o conftest -g -O2 -no-cpp-precomp conftest.c 1>&5
configure:14209: checking for gethostbyaddr
configure:14237: gcc -o conftest -g -O2 -no-cpp-precomp conftest.c 1>&5
configure:14466: checking for yp_get_default_domain
configure:14494: gcc -o conftest -g -O2 -no-cpp-precomp conftest.c 1>&5
configure:14724: checking for dlopen
configure:14752: gcc -o conftest -g -O2 -no-cpp-precomp conftest.c 1>&5
configure:14982: checking for sin in -lm
configure:15001: gcc -o conftest -g -O2 -no-cpp-precomp conftest.c -lm 1>&5
configure:14994: warning: conflicting types for built-in function 'sin'
configure:15035: checking for res_search
configure:15063: gcc -o conftest -g -O2 -no-cpp-precomp conftest.c -lm 1>&5
configure:15571: checking for inet_aton
configure:15599: gcc -o conftest -g -O2 -no-cpp-precomp conftest.c -lm 1>&5
configure:15967: checking for dn_skipname
configure:15995: gcc -o conftest -g -O2 -no-cpp-precomp conftest.c -lm 1>&5
/usr/bin/ld: Undefined symbols:
_dn_skipname
collect2: ld returned 1 exit status
configure: failed program was:
#line 15972 "configure"
#include "confdefs.h"
/* System header to define __stub macros and hopefully few prototypes,
which can conflict with char dn_skipname(); below. */
#include <assert.h>
/* Override any gcc2 internal prototype to avoid an error. */
/* We use char because int might match the return type of a gcc2
builtin and then its argument prototype would still apply. */
char dn_skipname();
int main() {
/* The GNU C library defines this for functions which it implements
to always fail with ENOSYS. Some functions are actually named
something starting with __ and the normal name is an alias. */
#if defined (__stub_dn_skipname) || defined (__stub___dn_skipname)
choke me
#else
dn_skipname();
#endif
; return 0; }
configure:16013: checking for __dn_skipname
configure:16041: gcc -o conftest -g -O2 -no-cpp-precomp conftest.c -lm 1>&5
configure:16361: checking for ANSI C header files
configure:16374: gcc -E -no-cpp-precomp conftest.c >/dev/null 2>conftest.out
configure:16441: gcc -o conftest -g -O2 -no-cpp-precomp conftest.c -lm 1>&5
configure: In function 'main':
configure:16436: warning: incompatible implicit declaration of built-in function 'exit'
configure:16469: checking for dirent.h that defines DIR
configure:16482: gcc -c -g -O2 -no-cpp-precomp conftest.c 1>&5
configure:16507: checking for opendir in -ldir
configure:16526: gcc -o conftest -g -O2 -no-cpp-precomp conftest.c -ldir -lm 1>&5
/usr/bin/ld: can't locate file for: -ldir
collect2: ld returned 1 exit status
configure: failed program was:
#line 16515 "configure"
#include "confdefs.h"
/* Override any gcc2 internal prototype to avoid an error. */
/* We use char because int might match the return type of a gcc2
builtin and then its argument prototype would still apply. */
char opendir();
int main() {
opendir()
; return 0; }
configure:16647: checking for inttypes.h
configure:16657: gcc -E -no-cpp-precomp conftest.c >/dev/null 2>conftest.out
configure:16647: checking for stdint.h
configure:16657: gcc -E -no-cpp-precomp conftest.c >/dev/null 2>conftest.out
configure:16647: checking for dirent.h
configure:16657: gcc -E -no-cpp-precomp conftest.c >/dev/null 2>conftest.out
configure:16647: checking for ApplicationServices/ApplicationServices.h
configure:16657: gcc -E -no-cpp-precomp conftest.c >/dev/null 2>conftest.out
configure:16647: checking for sys/param.h
configure:16657: gcc -E -no-cpp-precomp conftest.c >/dev/null 2>conftest.out
configure:16647: checking for sys/types.h
configure:16657: gcc -E -no-cpp-precomp conftest.c >/dev/null 2>conftest.out
configure:16647: checking for sys/time.h
configure:16657: gcc -E -no-cpp-precomp conftest.c >/dev/null 2>conftest.out
configure:16647: checking for netinet/in.h
configure:16657: gcc -E -no-cpp-precomp conftest.c >/dev/null 2>conftest.out
configure:16647: checking for alloca.h
configure:16657: gcc -E -no-cpp-precomp conftest.c >/dev/null 2>conftest.out
configure:16647: checking for arpa/inet.h
configure:16657: gcc -E -no-cpp-precomp conftest.c >/dev/null 2>conftest.out
configure:16647: checking for arpa/nameser.h
configure:16657: gcc -E -no-cpp-precomp conftest.c >/dev/null 2>conftest.out
configure:16647: checking for assert.h
configure:16657: gcc -E -no-cpp-precomp conftest.c >/dev/null 2>conftest.out
configure:16647: checking for crypt.h
configure:16657: gcc -E -no-cpp-precomp conftest.c >/dev/null 2>conftest.out
configure:16653:19: error: crypt.h: No such file or directory
configure: failed program was:
#line 16652 "configure"
#include "confdefs.h"
#include <crypt.h>
configure:16647: checking for fcntl.h
configure:16657: gcc -E -no-cpp-precomp conftest.c >/dev/null 2>conftest.out
configure:16647: checking for grp.h
configure:16657: gcc -E -no-cpp-precomp conftest.c >/dev/null 2>conftest.out
configure:16647: checking for ieeefp.h
configure:16657: gcc -E -no-cpp-precomp conftest.c >/dev/null 2>conftest.out
configure:16653:20: error: ieeefp.h: No such file or directory
configure: failed program was:
#line 16652 "configure"
#include "confdefs.h"
#include <ieeefp.h>
configure:16647: checking for langinfo.h
configure:16657: gcc -E -no-cpp-precomp conftest.c >/dev/null 2>conftest.out
configure:16647: checking for limits.h
configure:16657: gcc -E -no-cpp-precomp conftest.c >/dev/null 2>conftest.out
configure:16647: checking for locale.h
configure:16657: gcc -E -no-cpp-precomp conftest.c >/dev/null 2>conftest.out
configure:16647: checking for monetary.h
configure:16657: gcc -E -no-cpp-precomp conftest.c >/dev/null 2>conftest.out
configure:16647: checking for mach-o/dyld.h
configure:16657: gcc -E -no-cpp-precomp conftest.c >/dev/null 2>conftest.out
configure:16647: checking for netdb.h
configure:16657: gcc -E -no-cpp-precomp conftest.c >/dev/null 2>conftest.out
configure:16647: checking for pwd.h
configure:16657: gcc -E -no-cpp-precomp conftest.c >/dev/null 2>conftest.out
configure:16647: checking for resolv.h
configure:16657: gcc -E -no-cpp-precomp conftest.c >/dev/null 2>conftest.out
configure:16647: checking for signal.h
configure:16657: gcc -E -no-cpp-precomp conftest.c >/dev/null 2>conftest.out
configure:16647: checking for stdarg.h
configure:16657: gcc -E -no-cpp-precomp conftest.c >/dev/null 2>conftest.out
configure:16647: checking for stdlib.h
configure:16657: gcc -E -no-cpp-precomp conftest.c >/dev/null 2>conftest.out
configure:16647: checking for string.h
configure:16657: gcc -E -no-cpp-precomp conftest.c >/dev/null 2>conftest.out
configure:16647: checking for syslog.h
configure:16657: gcc -E -no-cpp-precomp conftest.c >/dev/null 2>conftest.out
configure:16647: checking for sysexits.h
configure:16657: gcc -E -no-cpp-precomp conftest.c >/dev/null 2>conftest.out
configure:16647: checking for sys/ioctl.h
configure:16657: gcc -E -no-cpp-precomp conftest.c >/dev/null 2>conftest.out
configure:16647: checking for sys/file.h
configure:16657: gcc -E -no-cpp-precomp conftest.c >/dev/null 2>conftest.out
configure:16647: checking for sys/mman.h
configure:16657: gcc -E -no-cpp-precomp conftest.c >/dev/null 2>conftest.out
configure:16647: checking for sys/mount.h
configure:16657: gcc -E -no-cpp-precomp conftest.c >/dev/null 2>conftest.out
configure:16647: checking for sys/poll.h
configure:16657: gcc -E -no-cpp-precomp conftest.c >/dev/null 2>conftest.out
configure:16647: checking for sys/resource.h
configure:16657: gcc -E -no-cpp-precomp conftest.c >/dev/null 2>conftest.out
configure:16647: checking for sys/select.h
configure:16657: gcc -E -no-cpp-precomp conftest.c >/dev/null 2>conftest.out
configure:16647: checking for sys/socket.h
configure:16657: gcc -E -no-cpp-precomp conftest.c >/dev/null 2>conftest.out
configure:16647: checking for sys/statfs.h
configure:16657: gcc -E -no-cpp-precomp conftest.c >/dev/null 2>conftest.out
configure:16653:24: error: sys/statfs.h: No such file or directory
configure: failed program was:
#line 16652 "configure"
#include "confdefs.h"
#include <sys/statfs.h>
configure:16647: checking for sys/statvfs.h
configure:16657: gcc -E -no-cpp-precomp conftest.c >/dev/null 2>conftest.out
configure:16647: checking for sys/vfs.h
configure:16657: gcc -E -no-cpp-precomp conftest.c >/dev/null 2>conftest.out
configure:16653:21: error: sys/vfs.h: No such file or directory
configure: failed program was:
#line 16652 "configure"
#include "confdefs.h"
#include <sys/vfs.h>
configure:16647: checking for sys/sysexits.h
configure:16657: gcc -E -no-cpp-precomp conftest.c >/dev/null 2>conftest.out
configure:16653:26: error: sys/sysexits.h: No such file or directory
configure: failed program was:
#line 16652 "configure"
#include "confdefs.h"
#include <sys/sysexits.h>
configure:16647: checking for sys/varargs.h
configure:16657: gcc -E -no-cpp-precomp conftest.c >/dev/null 2>conftest.out
configure:16653:25: error: sys/varargs.h: No such file or directory
configure: failed program was:
#line 16652 "configure"
#include "confdefs.h"
#include <sys/varargs.h>
configure:16647: checking for sys/wait.h
configure:16657: gcc -E -no-cpp-precomp conftest.c >/dev/null 2>conftest.out
configure:16647: checking for termios.h
configure:16657: gcc -E -no-cpp-precomp conftest.c >/dev/null 2>conftest.out
configure:16647: checking for unistd.h
configure:16657: gcc -E -no-cpp-precomp conftest.c >/dev/null 2>conftest.out
configure:16647: checking for unix.h
configure:16657: gcc -E -no-cpp-precomp conftest.c >/dev/null 2>conftest.out
configure:16653:18: error: unix.h: No such file or directory
configure: failed program was:
#line 16652 "configure"
#include "confdefs.h"
#include <unix.h>
configure:16647: checking for utime.h
configure:16657: gcc -E -no-cpp-precomp conftest.c >/dev/null 2>conftest.out
configure:16647: checking for sys/utsname.h
configure:16657: gcc -E -no-cpp-precomp conftest.c >/dev/null 2>conftest.out
configure:16647: checking for sys/ipc.h
configure:16657: gcc -E -no-cpp-precomp conftest.c >/dev/null 2>conftest.out
configure:16647: checking for dlfcn.h
configure:16657: gcc -E -no-cpp-precomp conftest.c >/dev/null 2>conftest.out
configure:16647: checking for assert.h
configure:16686: checking for fopencookie
configure:16714: gcc -o conftest -g -O2 -no-cpp-precomp conftest.c -lm 1>&5
/usr/bin/ld: Undefined symbols:
_fopencookie
collect2: ld returned 1 exit status
configure: failed program was:
#line 16691 "configure"
#include "confdefs.h"
/* System header to define __stub macros and hopefully few prototypes,
which can conflict with char fopencookie(); below. */
#include <assert.h>
/* Override any gcc2 internal prototype to avoid an error. */
/* We use char because int might match the return type of a gcc2
builtin and then its argument prototype would still apply. */
char fopencookie();
int main() {
/* The GNU C library defines this for functions which it implements
to always fail with ENOSYS. Some functions are actually named
something starting with __ and the normal name is an alias. */
#if defined (__stub_fopencookie) || defined (__stub___fopencookie)
choke me
#else
fopencookie();
#endif
; return 0; }
configure:16861: checking for broken getcwd
configure:16876: checking for broken libc stdio
configure:16937: gcc -o conftest -g -O2 -no-cpp-precomp conftest.c -lm 1>&5
configure: In function 'main':
configure:16921: warning: incompatible implicit declaration of built-in function 'exit'
configure:16965: checking whether struct tm is in sys/time.h or time.h
configure:16978: gcc -c -g -O2 -no-cpp-precomp conftest.c 1>&5
configure:16999: checking for tm_zone in struct tm
configure:17012: gcc -c -g -O2 -no-cpp-precomp conftest.c 1>&5
configure:17071: checking for missing declarations of reentrant functions
configure:17080: gcc -c -g -O2 -no-cpp-precomp conftest.c 1>&5
configure:17105: gcc -c -g -O2 -no-cpp-precomp conftest.c 1>&5
configure:17130: gcc -c -g -O2 -no-cpp-precomp conftest.c 1>&5
configure:17155: gcc -c -g -O2 -no-cpp-precomp conftest.c 1>&5
configure:17180: gcc -c -g -O2 -no-cpp-precomp conftest.c 1>&5
configure:17201: checking for fclose declaration
configure:17210: gcc -c -g -O2 -no-cpp-precomp conftest.c 1>&5
configure:17236: checking for tm_gmtoff in struct tm
configure:17249: gcc -c -g -O2 -no-cpp-precomp conftest.c 1>&5
configure:17272: checking for struct flock
configure:17287: gcc -c -g -O2 -no-cpp-precomp conftest.c 1>&5
configure:17314: checking for socklen_t
configure:17331: gcc -c -g -O2 -no-cpp-precomp conftest.c 1>&5
configure:17357: checking size of intmax_t
configure:17376: gcc -o conftest -g -O2 -no-cpp-precomp conftest.c -lm 1>&5
configure: In function 'main':
configure:17371: error: 'intmax_t' undeclared (first use in this function)
configure:17371: error: (Each undeclared identifier is reported only once
configure:17371: error: for each function it appears in.)
configure: failed program was:
#line 17365 "configure"
#include "confdefs.h"
#include <stdio.h>
int main()
{
FILE *f=fopen("conftestval", "w");
if (!f) return(1);
fprintf(f, "%d\n", sizeof(intmax_t));
return(0);
}
configure:17396: checking size of size_t
configure:17415: gcc -o conftest -g -O2 -no-cpp-precomp conftest.c -lm 1>&5
configure:17435: checking size of ssize_t
configure:17454: gcc -o conftest -g -O2 -no-cpp-precomp conftest.c -lm 1>&5
configure: In function 'main':
configure:17449: error: 'ssize_t' undeclared (first use in this function)
configure:17449: error: (Each undeclared identifier is reported only once
configure:17449: error: for each function it appears in.)
configure: failed program was:
#line 17443 "configure"
#include "confdefs.h"
#include <stdio.h>
int main()
{
FILE *f=fopen("conftestval", "w");
if (!f) return(1);
fprintf(f, "%d\n", sizeof(ssize_t));
return(0);
}
configure:17474: checking size of ptrdiff_t
configure:17493: gcc -o conftest -g -O2 -no-cpp-precomp conftest.c -lm 1>&5
configure: In function 'main':
configure:17488: error: 'ptrdiff_t' undeclared (first use in this function)
configure:17488: error: (Each undeclared identifier is reported only once
configure:17488: error: for each function it appears in.)
configure: failed program was:
#line 17482 "configure"
#include "confdefs.h"
#include <stdio.h>
int main()
{
FILE *f=fopen("conftestval", "w");
if (!f) return(1);
fprintf(f, "%d\n", sizeof(ptrdiff_t));
return(0);
}
configure:17513: checking size of long long
configure:17532: gcc -o conftest -g -O2 -no-cpp-precomp conftest.c -lm 1>&5
configure:17552: checking size of long long int
configure:17571: gcc -o conftest -g -O2 -no-cpp-precomp conftest.c -lm 1>&5
configure:17591: checking size of long
configure:17610: gcc -o conftest -g -O2 -no-cpp-precomp conftest.c -lm 1>&5
configure:17630: checking size of int
configure:17649: gcc -o conftest -g -O2 -no-cpp-precomp conftest.c -lm 1>&5
configure:17670: checking for st_blksize in struct stat
configure:17683: gcc -c -g -O2 -no-cpp-precomp conftest.c 1>&5
configure:17705: checking for st_blocks in struct stat
configure:17718: gcc -c -g -O2 -no-cpp-precomp conftest.c 1>&5
configure:17745: checking for st_rdev in struct stat
configure:17758: gcc -c -g -O2 -no-cpp-precomp conftest.c 1>&5
configure:17780: checking for size_t
configure:17813: checking for uid_t in sys/types.h
configure:17849: checking for struct sockaddr_storage
configure:17862: gcc -c -g -O2 -no-cpp-precomp conftest.c 1>&5
configure:17883: checking for field sa_len in struct sockaddr
configure:17897: gcc -c -g -O2 -no-cpp-precomp conftest.c 1>&5
configure:17920: checking for IPv6 support
configure:17934: gcc -o conftest -g -O2 -no-cpp-precomp conftest.c -lm 1>&5
configure:17950: checking for vprintf
configure:17978: gcc -o conftest -g -O2 -no-cpp-precomp conftest.c -lm 1>&5
configure:17962: warning: conflicting types for built-in function 'vprintf'
configure:18133: checking for alphasort
configure:18161: gcc -o conftest -g -O2 -no-cpp-precomp conftest.c -lm 1>&5
configure:18133: checking for asctime_r
configure:18161: gcc -o conftest -g -O2 -no-cpp-precomp conftest.c -lm 1>&5
configure:18133: checking for chroot
configure:18161: gcc -o conftest -g -O2 -no-cpp-precomp conftest.c -lm 1>&5
configure:18133: checking for ctime_r
configure:18161: gcc -o conftest -g -O2 -no-cpp-precomp conftest.c -lm 1>&5
configure:18133: checking for cuserid
configure:18161: gcc -o conftest -g -O2 -no-cpp-precomp conftest.c -lm 1>&5
/usr/bin/ld: Undefined symbols:
_cuserid
collect2: ld returned 1 exit status
configure: failed program was:
#line 18138 "configure"
#include "confdefs.h"
/* System header to define __stub macros and hopefully few prototypes,
which can conflict with char cuserid(); below. */
#include <assert.h>
/* Override any gcc2 internal prototype to avoid an error. */
/* We use char because int might match the return type of a gcc2
builtin and then its argument prototype would still apply. */
char cuserid();
int main() {
/* The GNU C library defines this for functions which it implements
to always fail with ENOSYS. Some functions are actually named
something starting with __ and the normal name is an alias. */
#if defined (__stub_cuserid) || defined (__stub___cuserid)
choke me
#else
cuserid();
#endif
; return 0; }
configure:18133: checking for crypt
configure:18161: gcc -o conftest -g -O2 -no-cpp-precomp conftest.c -lm 1>&5
configure:18133: checking for flock
configure:18161: gcc -o conftest -g -O2 -no-cpp-precomp conftest.c -lm 1>&5
configure:18133: checking for ftok
configure:18161: gcc -o conftest -g -O2 -no-cpp-precomp conftest.c -lm 1>&5
configure:18133: checking for funopen
configure:18161: gcc -o conftest -g -O2 -no-cpp-precomp conftest.c -lm 1>&5
configure:18133: checking for gai_strerror
configure:18161: gcc -o conftest -g -O2 -no-cpp-precomp conftest.c -lm 1>&5
configure:18133: checking for gcvt
configure:18161: gcc -o conftest -g -O2 -no-cpp-precomp conftest.c -lm 1>&5
configure:18133: checking for getloadavg
configure:18161: gcc -o conftest -g -O2 -no-cpp-precomp conftest.c -lm 1>&5
configure:18133: checking for getlogin
configure:18161: gcc -o conftest -g -O2 -no-cpp-precomp conftest.c -lm 1>&5
configure:18133: checking for getprotobyname
configure:18161: gcc -o conftest -g -O2 -no-cpp-precomp conftest.c -lm 1>&5
configure:18133: checking for getprotobynumber
configure:18161: gcc -o conftest -g -O2 -no-cpp-precomp conftest.c -lm 1>&5
configure:18133: checking for getservbyname
configure:18161: gcc -o conftest -g -O2 -no-cpp-precomp conftest.c -lm 1>&5
configure:18133: checking for getservbyport
configure:18161: gcc -o conftest -g -O2 -no-cpp-precomp conftest.c -lm 1>&5
configure:18133: checking for getrusage
configure:18161: gcc -o conftest -g -O2 -no-cpp-precomp conftest.c -lm 1>&5
configure:18133: checking for gettimeofday
configure:18161: gcc -o conftest -g -O2 -no-cpp-precomp conftest.c -lm 1>&5
configure:18133: checking for gmtime_r
configure:18161: gcc -o conftest -g -O2 -no-cpp-precomp conftest.c -lm 1>&5
configure:18133: checking for grantpt
configure:18161: gcc -o conftest -g -O2 -no-cpp-precomp conftest.c -lm 1>&5
configure:18133: checking for inet_ntoa
configure:18161: gcc -o conftest -g -O2 -no-cpp-precomp conftest.c -lm 1>&5
configure:18133: checking for inet_ntop
configure:18161: gcc -o conftest -g -O2 -no-cpp-precomp conftest.c -lm 1>&5
configure:18133: checking for inet_pton
configure:18161: gcc -o conftest -g -O2 -no-cpp-precomp conftest.c -lm 1>&5
configure:18133: checking for isascii
configure:18161: gcc -o conftest -g -O2 -no-cpp-precomp conftest.c -lm 1>&5
configure:18145: warning: conflicting types for built-in function 'isascii'
configure:18133: checking for link
configure:18161: gcc -o conftest -g -O2 -no-cpp-precomp conftest.c -lm 1>&5
configure:18133: checking for localtime_r
configure:18161: gcc -o conftest -g -O2 -no-cpp-precomp conftest.c -lm 1>&5
configure:18133: checking for lockf
configure:18161: gcc -o conftest -g -O2 -no-cpp-precomp conftest.c -lm 1>&5
configure:18133: checking for lchown
configure:18161: gcc -o conftest -g -O2 -no-cpp-precomp conftest.c -lm 1>&5
configure:18133: checking for lrand48
configure:18161: gcc -o conftest -g -O2 -no-cpp-precomp conftest.c -lm 1>&5
configure:18133: checking for memcpy
configure:18161: gcc -o conftest -g -O2 -no-cpp-precomp conftest.c -lm 1>&5
configure:18145: warning: conflicting types for built-in function 'memcpy'
configure:18133: checking for memmove
configure:18161: gcc -o conftest -g -O2 -no-cpp-precomp conftest.c -lm 1>&5
configure:18145: warning: conflicting types for built-in function 'memmove'
configure:18133: checking for mkstemp
configure:18161: gcc -o conftest -g -O2 -no-cpp-precomp conftest.c -lm 1>&5
configure:18133: checking for mmap
configure:18161: gcc -o conftest -g -O2 -no-cpp-precomp conftest.c -lm 1>&5
configure:18133: checking for nl_langinfo
configure:18161: gcc -o conftest -g -O2 -no-cpp-precomp conftest.c -lm 1>&5
configure:18133: checking for perror
configure:18161: gcc -o conftest -g -O2 -no-cpp-precomp conftest.c -lm 1>&5
configure:18133: checking for poll
configure:18161: gcc -o conftest -g -O2 -no-cpp-precomp conftest.c -lm 1>&5
configure:18133: checking for ptsname
configure:18161: gcc -o conftest -g -O2 -no-cpp-precomp conftest.c -lm 1>&5
configure:18133: checking for putenv
configure:18161: gcc -o conftest -g -O2 -no-cpp-precomp conftest.c -lm 1>&5
configure:18133: checking for realpath
configure:18161: gcc -o conftest -g -O2 -no-cpp-precomp conftest.c -lm 1>&5
configure:18133: checking for random
configure:18161: gcc -o conftest -g -O2 -no-cpp-precomp conftest.c -lm 1>&5
configure:18133: checking for rand_r
configure:18161: gcc -o conftest -g -O2 -no-cpp-precomp conftest.c -lm 1>&5
configure:18133: checking for regcomp
configure:18161: gcc -o conftest -g -O2 -no-cpp-precomp conftest.c -lm 1>&5
configure:18133: checking for res_search
configure:18133: checking for scandir
configure:18161: gcc -o conftest -g -O2 -no-cpp-precomp conftest.c -lm 1>&5
configure:18133: checking for setitimer
configure:18161: gcc -o conftest -g -O2 -no-cpp-precomp conftest.c -lm 1>&5
configure:18133: checking for setlocale
configure:18161: gcc -o conftest -g -O2 -no-cpp-precomp conftest.c -lm 1>&5
configure:18133: checking for localeconv
configure:18161: gcc -o conftest -g -O2 -no-cpp-precomp conftest.c -lm 1>&5
configure:18133: checking for setpgid
configure:18161: gcc -o conftest -g -O2 -no-cpp-precomp conftest.c -lm 1>&5
configure:18133: checking for setsockopt
configure:18161: gcc -o conftest -g -O2 -no-cpp-precomp conftest.c -lm 1>&5
configure:18133: checking for setvbuf
configure:18161: gcc -o conftest -g -O2 -no-cpp-precomp conftest.c -lm 1>&5
configure:18133: checking for shutdown
configure:18161: gcc -o conftest -g -O2 -no-cpp-precomp conftest.c -lm 1>&5
configure:18133: checking for sin
configure:18161: gcc -o conftest -g -O2 -no-cpp-precomp conftest.c -lm 1>&5
configure:18145: warning: conflicting types for built-in function 'sin'
configure:18133: checking for snprintf
configure:18161: gcc -o conftest -g -O2 -no-cpp-precomp conftest.c -lm 1>&5
configure:18145: warning: conflicting types for built-in function 'snprintf'
configure:18133: checking for srand48
configure:18161: gcc -o conftest -g -O2 -no-cpp-precomp conftest.c -lm 1>&5
configure:18133: checking for srandom
configure:18161: gcc -o conftest -g -O2 -no-cpp-precomp conftest.c -lm 1>&5
configure:18133: checking for statfs
configure:18161: gcc -o conftest -g -O2 -no-cpp-precomp conftest.c -lm 1>&5
configure:18133: checking for statvfs
configure:18161: gcc -o conftest -g -O2 -no-cpp-precomp conftest.c -lm 1>&5
configure:18133: checking for std_syslog
configure:18161: gcc -o conftest -g -O2 -no-cpp-precomp conftest.c -lm 1>&5
/usr/bin/ld: Undefined symbols:
_std_syslog
collect2: ld returned 1 exit status
configure: failed program was:
#line 18138 "configure"
#include "confdefs.h"
/* System header to define __stub macros and hopefully few prototypes,
which can conflict with char std_syslog(); below. */
#include <assert.h>
/* Override any gcc2 internal prototype to avoid an error. */
/* We use char because int might match the return type of a gcc2
builtin and then its argument prototype would still apply. */
char std_syslog();
int main() {
/* The GNU C library defines this for functions which it implements
to always fail with ENOSYS. Some functions are actually named
something starting with __ and the normal name is an alias. */
#if defined (__stub_std_syslog) || defined (__stub___std_syslog)
choke me
#else
std_syslog();
#endif
; return 0; }
configure:18133: checking for strcasecmp
configure:18161: gcc -o conftest -g -O2 -no-cpp-precomp conftest.c -lm 1>&5
configure:18133: checking for strcoll
configure:18161: gcc -o conftest -g -O2 -no-cpp-precomp conftest.c -lm 1>&5
configure:18133: checking for strdup
configure:18161: gcc -o conftest -g -O2 -no-cpp-precomp conftest.c -lm 1>&5
configure:18145: warning: conflicting types for built-in function 'strdup'
configure:18133: checking for strerror
configure:18161: gcc -o conftest -g -O2 -no-cpp-precomp conftest.c -lm 1>&5
configure:18133: checking for strftime
configure:18161: gcc -o conftest -g -O2 -no-cpp-precomp conftest.c -lm 1>&5
configure:18145: warning: conflicting types for built-in function 'strftime'
configure:18133: checking for strptime
configure:18161: gcc -o conftest -g -O2 -no-cpp-precomp conftest.c -lm 1>&5
configure:18133: checking for strstr
configure:18161: gcc -o conftest -g -O2 -no-cpp-precomp conftest.c -lm 1>&5
configure:18145: warning: conflicting types for built-in function 'strstr'
configure:18133: checking for strtok_r
configure:18161: gcc -o conftest -g -O2 -no-cpp-precomp conftest.c -lm 1>&5
configure:18133: checking for symlink
configure:18161: gcc -o conftest -g -O2 -no-cpp-precomp conftest.c -lm 1>&5
configure:18133: checking for tempnam
configure:18161: gcc -o conftest -g -O2 -no-cpp-precomp conftest.c -lm 1>&5
configure:18133: checking for tzset
configure:18161: gcc -o conftest -g -O2 -no-cpp-precomp conftest.c -lm 1>&5
configure:18133: checking for unlockpt
configure:18161: gcc -o conftest -g -O2 -no-cpp-precomp conftest.c -lm 1>&5
configure:18133: checking for unsetenv
configure:18161: gcc -o conftest -g -O2 -no-cpp-precomp conftest.c -lm 1>&5
configure:18133: checking for usleep
configure:18161: gcc -o conftest -g -O2 -no-cpp-precomp conftest.c -lm 1>&5
configure:18133: checking for nanosleep
configure:18161: gcc -o conftest -g -O2 -no-cpp-precomp conftest.c -lm 1>&5
configure:18133: checking for utime
configure:18161: gcc -o conftest -g -O2 -no-cpp-precomp conftest.c -lm 1>&5
configure:18133: checking for vsnprintf
configure:18161: gcc -o conftest -g -O2 -no-cpp-precomp conftest.c -lm 1>&5
configure:18145: warning: conflicting types for built-in function 'vsnprintf'
configure:18187: checking for getaddrinfo
configure:18199: gcc -o conftest -g -O2 -no-cpp-precomp conftest.c -lm 1>&5
configure:18245: gcc -o conftest -g -O2 -no-cpp-precomp conftest.c -lm 1>&5
configure: In function 'main':
configure:18215: warning: incompatible implicit declaration of built-in function 'memset'
configure:18219: warning: incompatible implicit declaration of built-in function 'exit'
configure:18223: warning: incompatible implicit declaration of built-in function 'exit'
configure:18231: warning: incompatible implicit declaration of built-in function 'exit'
configure:18235: warning: incompatible implicit declaration of built-in function 'exit'
configure:18240: warning: incompatible implicit declaration of built-in function 'exit'
configure:18277: checking for strlcat
configure:18305: gcc -o conftest -g -O2 -no-cpp-precomp conftest.c -lm 1>&5
configure:18277: checking for strlcpy
configure:18305: gcc -o conftest -g -O2 -no-cpp-precomp conftest.c -lm 1>&5
configure:18277: checking for getopt
configure:18305: gcc -o conftest -g -O2 -no-cpp-precomp conftest.c -lm 1>&5
configure:18332: checking whether utime accepts a null argument
configure:18353: gcc -o conftest -g -O2 -no-cpp-precomp conftest.c -lm 1>&5
configure: In function 'main':
configure:18347: warning: incompatible implicit declaration of built-in function 'exit'
configure:18379: checking for working alloca.h
configure:18412: checking for alloca
configure:18445: gcc -o conftest -g -O2 -no-cpp-precomp conftest.c -lm 1>&5
configure:18612: checking for declared timezone
configure:18633: gcc -c -g -O2 -no-cpp-precomp conftest.c 1>&5
configure:18659: checking for type of reentrant time-related functions
configure:18688: gcc -o conftest -g -O2 -no-cpp-precomp conftest.c -lm 1>&5
configure: In function 'main':
configure:18680: warning: assignment makes integer from pointer without a cast
configure:18681: error: too many arguments to function 'asctime_r'
configure: failed program was:
#line 18670 "configure"
#include "confdefs.h"
#include <time.h>
main() {
char buf[27];
struct tm t;
time_t old = 0;
int r, s;
s = gmtime_r(&old, &t);
r = (int) asctime_r(&t, buf, 26);
if (r == s && s == 0) return (0);
return (1);
}
configure:18720: gcc -o conftest -g -O2 -no-cpp-precomp conftest.c -lm 1>&5
configure: In function 'main':
configure:18713: error: too many arguments to function 'asctime_r'
configure: failed program was:
#line 18704 "configure"
#include "confdefs.h"
#include <time.h>
main() {
struct tm t, *s;
time_t old = 0;
char buf[27], *p;
s = gmtime_r(&old, &t);
p = asctime_r(&t, buf, 26);
if (p == buf && s == &t) return (0);
return (1);
}
configure:18758: checking for readdir_r
configure:18786: gcc -o conftest -g -O2 -no-cpp-precomp conftest.c -lm 1>&5
configure:18808: checking for type of readdir_r
configure:18844: gcc -o conftest -g -O2 -no-cpp-precomp conftest.c -lm 1>&5
configure: In function 'main':
configure:18836: warning: incompatible implicit declaration of built-in function 'exit'
configure:18907: checking for in_addr_t
configure:18963: checking whether to include gcov symbols
configure:19123: checking whether to include debugging symbols
configure:19156: checking layout of installed files
configure:19190: checking path to configuration file
configure:19226: checking where to scan for configuration files
configure:19256: checking whether to enable safe mode by default
configure:19291: checking for safe mode exec dir
configure:19332: checking whether to enable PHP's own SIGCHLD handler
configure:19369: checking whether to enable magic quotes by default
configure:19406: checking whether to enable runpaths
configure:19431: checking whether to explicitly link against libgcc
configure:19510: checking whether to enable short tags by default
configure:19547: checking whether to enable dmalloc
configure:19635: checking whether to enable IPv6 support
configure:19665: checking how big to make fd sets
configure:19685: checking whether to enable versioning
configure:19733: checking whether to enable LIBXML support
configure:19780: checking libxml2 install dir
configure:19809: checking for xml2-config path
configure:19966: checking whether libxml build works
configure:19993: gcc -o conftest -g -O2 -no-cpp-precomp conftest.c
-lm -lxml2 -lz -liconv -lm 1>&5
configure:20346: checking for OpenSSL support
configure:20392: checking for Kerberos support
configure:21759: checking for PCRE support
configure:22567: checking for ZLIB support
configure:22613: checking if the location of ZLIB install directory is defined
configure:23047: checking for gzgets in -lz
configure:23066: gcc -o conftest -g -O2 -no-cpp-precomp -L/usr//lib -L/usr//lib conftest.c -lz -lm -lxml2 -lz -liconv -lm 1>&5
configure:23204: checking whether to enable bc style precision math functions
configure:23560: checking for BZip2 support
configure:24194: checking whether to enable calendar conversion support
configure:24529: checking whether to enable ctype functions
configure:24864: checking for CURL support
configure:24910: checking if we should use CURL for url streams
configure:25915: checking size of long
configure:25954: checking size of int
configure:25994: checking for int32_t
configure:26019: gcc -c -g -O2 -no-cpp-precomp conftest.c 1>&5
configure:26042: checking for uint32_t
configure:26067: gcc -c -g -O2 -no-cpp-precomp conftest.c 1>&5
configure:26099: checking for sys/types.h
configure:26099: checking for inttypes.h
configure:26099: checking for stdint.h
configure:26099: checking for string.h
configure:26099: checking for stdlib.h
configure:26139: checking for strtoll
configure:26167: gcc -o conftest -g -O2 -no-cpp-precomp -L/usr//lib -L/usr//lib conftest.c -lz -lm -lxml2 -lz -liconv -lm 1>&5
configure:26139: checking for atoll
configure:26167: gcc -o conftest -g -O2 -no-cpp-precomp -L/usr//lib -L/usr//lib conftest.c -lz -lm -lxml2 -lz -liconv -lm 1>&5
configure:26139: checking for strftime
configure:26594: checking whether to enable DBA
configure:26940: checking for QDBM support
configure:27275: checking for GDBM support
configure:27596: checking for NDBM support
configure:27901: checking for Berkeley DB4 support
configure:28227: checking for Berkeley DB3 support
configure:28553: checking for Berkeley DB2 support
configure:28797: checking for DB1 support
configure:29156: checking for DBM support
configure:29513: checking for CDB support
configure:29567: checking for INI File support
configure:29621: checking for FlatFile support
configure:29636: checking whether to enable DBA interface
configure:29950: checking whether to enable dbase support
configure:30285: checking whether to enable DOM support
configure:30363: checking for xml2-config path
configure:30520: checking whether libxml build works
configure:30958: checking whether to enable EXIF (metadata from images) support
configure:31293: checking for FrontBase SQL92 (fbsql) support
configure:31787: checking for FDF support
configure:32603: checking whether to enable the bundled filePro support
configure:32938: checking whether to enable FTP support
configure:32984: checking OpenSSL dir for FTP
configure:33985: checking for GD support
configure:34032: checking for the location of libjpeg
configure:34059: checking for the location of libpng
configure:34112: checking for the location of libXpm
configure:34137: checking for FreeType 1.x support
configure:34162: checking for FreeType 2
configure:34187: checking for T1lib support
configure:34212: checking whether to enable truetype string function in GD
configure:34237: checking whether to enable JIS-mapped Japanese font support in GD
configure:41994: checking for GNU gettext support
configure:42742: checking for GNU MP support
configure:43513: checking whether to enable hash support
configure:43563: checking whether byte ordering is bigendian
configure:43614: checking size of short
configure:43633: gcc -o conftest -g -O2 -no-cpp-precomp -L/usr//lib -L/usr//lib conftest.c -lz -lm -lxml2 -lz -liconv -lm -lxml2 -lz -liconv -lm 1>&5
configure:43653: checking size of int
configure:43692: checking size of long
configure:43731: checking size of long long
configure:44086: checking for hwapi support
configure:44873: checking for iconv support
configure:44935: checking for iconv
configure:44963: gcc -o conftest -g -O2 -no-cpp-precomp -L/usr//lib -L/usr//lib conftest.c -lz -lm -lxml2 -lz -liconv -lm -lxml2 -lz -liconv -lm 1>&5
configure:45548: checking if iconv is glibc's
configure:45557: gcc -o conftest -I/usr/include -g -O2 -no-cpp-precomp -L/usr/lib -L/usr//lib -L/usr//lib conftest.c -lz -lm -lxml2 -lz -liconv -lm -lxml2 -lz -liconv -lm 1>&5
configure:45551:30: error: gnu/libc-version.h: No such file or directory
configure: failed program was:
#line 45550 "configure"
#include "confdefs.h"
#include <gnu/libc-version.h>
int main() {
gnu_get_libc_version();
; return 0; }
configure:45575: checking if using GNU libiconv
configure:45592: gcc -o conftest -I/usr/include -g -O2 -no-cpp-precomp -liconv -L/usr/lib -L/usr//lib -L/usr//lib conftest.c -lz -lm -lxml2 -lz -liconv -lm -lxml2 -lz -liconv -lm 1>&5
configure: In function 'main':
configure:45586: warning: incompatible implicit declaration of built-in function 'printf'
configure:45790: checking if iconv supports errno
configure:45825: gcc -o conftest -I/usr/include -g -O2 -no-cpp-precomp -liconv -L/usr/lib -L/usr//lib -L/usr//lib conftest.c -liconv -lz -lm -lxml2 -lz -liconv -lm -lxml2 -lz -liconv -lm 1>&5
configure:45857: checking if your cpp allows macro usage in include lines
configure:45869: gcc -c -I/usr/include -g -O2 -no-cpp-precomp conftest.c 1>&5
configure:46213: checking for IMAP support
configure:46259: checking for IMAP Kerberos support
configure:46284: checking for IMAP SSL support
configure:48444: checking for Informix support
configure:49057: checking for InterBase support
configure:49983: checking for LDAP support
configure:50029: checking for LDAP Cyrus SASL support
configure:52833: checking whether to enable multibyte string support
configure:52879: checking whether to enable multibyte regex support
configure:52904: checking for external libmbfl
configure:54489: checking for mcrypt support
configure:55320: checking for mhash support
configure:55794: checking whether to include mime_magic support
configure:56151: checking for MING support
configure:57083: checking for mSQL support
configure:57594: checking for MSSQL support via FreeTDS
configure:58244: checking for MySQL support
configure:58290: checking for specified location of the MySQL UNIX socket
configure:58347: checking for MySQL UNIX socket location
configure:58533: checking for mysql_close in -lmysqlclient
configure:58552: gcc -o conftest -I/usr/include -g -O2 -no-cpp-precomp -L/usr/local/mysql/lib -L/usr/local/mysql/lib -liconv -L/usr/lib -L/usr//lib -L/usr//lib conftest.c -lmysqlclient -liconv -lz -lm -lxml2 -lz -liconv -lm -lxml2 -lz -liconv -lm 1>&5
/usr/bin/ld: truncated or malformed archive: /usr/local/mysql/lib/libmysqlclient.a (ranlib structures in table of contents extends past the end of the table of contents, can't load from it)
collect2: ld returned 1 exit status
configure: failed program was:
#line 58541 "configure"
#include "confdefs.h"
/* Override any gcc2 internal prototype to avoid an error. */
/* We use char because int might match the return type of a gcc2
builtin and then its argument prototype would still apply. */
char mysql_close();
int main() {
mysql_close()
; return 0; }
configure:58773: checking for mysql_error in -lmysqlclient
configure:58792: gcc -o conftest -I/usr/include -g -O2 -no-cpp-precomp -L/usr/local/mysql/lib -L/usr/local/mysql/lib -L/usr//lib -L/usr//lib -liconv -L/usr/lib -L/usr//lib -L/usr//lib -L/usr/ -L/usr/ conftest.c -lmysqlclient -lz -liconv -lz -lm -lxml2 -lz -liconv -lm -lxml2 -lz -liconv -lm 1>&5
/usr/bin/ld: truncated or malformed archive: /usr/local/mysql/lib/libmysqlclient.a (ranlib structures in table of contents extends past the end of the table of contents, can't load from it)
collect2: ld returned 1 exit status
configure: failed program was:
#line 58781 "configure"
#include "confdefs.h"
/* Override any gcc2 internal prototype to avoid an error. */
/* We use char because int might match the return type of a gcc2
builtin and then its argument prototype would still apply. */
char mysql_error();
int main() {
mysql_error()
; return 0; }