Untitled
public text v1 · immutablehud.c: In function `click_quickbar_handler':
hud.c:1456: error: parse error before "else"
hud.c:1463: error: case label not within a switch statement
hud.c:1466: error: case label not within a switch statement
hud.c:1469: error: case label not within a switch statement
hud.c:1475: error: `default' label not within a switch statement
hud.c: At top level:
hud.c:1480: error: parse error before '}' token
make: *** [hud.o] Error 1