All pastes #22614 Raw Edit

Unnamed

public text v1 · immutable
#22614 ·published 2005-09-11 02:09 UTC
rendered paste body
-mpreferred-stack-boundary=2     -I../include -I. -I/var/tmp/portage/glibc-2.3.5-r1/work/build-default-i686-pc-linux-gnu-linuxthreads/wctype -I.. -I../libio  -I/var/tmp/portage/glibc-2.3.5-r1/work/build-default-i686-pc-linux-gnu-linuxthreads -I../sysdeps/i386/elf -I../linuxthreads/sysdeps/unix/sysv/linux/i386 -I../linuxthreads/sysdeps/unix/sysv/linux -I../linuxthreads/sysdeps/pthread -I../sysdeps/pthread -I../linuxthreads/sysdeps/unix/sysv -I../linuxthreads/sysdeps/unix -I../linuxthreads/sysdeps/i386/i686 -I../linuxthreads/sysdeps/i386 -I../libidn/sysdeps/unix -I../sysdeps/unix/sysv/linux/i386 -I../sysdeps/unix/sysv/linux -I../sysdeps/gnu -I../sysdeps/unix/common -I../sysdeps/unix/mman -I../sysdeps/unix/inet -I../sysdeps/unix/sysv/i386 -I../sysdeps/unix/sysv -I../sysdeps/unix/i386 -I../sysdeps/unix -I../sysdeps/posix -I../sysdeps/i386/i686/fpu -I../sysdeps/i386/i686 -I../sysdeps/i386/i486 -I../sysdeps/i386/fpu -I../sysdeps/i386 -I../sysdeps/wordsize-32 -I../sysdeps/ieee754/ldbl-96 -I../sysdeps/ieee754/dbl-64 -I../sysdeps/ieee754/flt-32 -I../sysdeps/ieee754 -I../sysdeps/generic/elf -I../sysdeps/generic -nostdinc -isystem /usr/lib/gcc-lib/i686-pc-linux-gnu/3.3.5-20050130/include -isystem //usr/include -D_LIBC_REENTRANT -include ../include/libc-symbols.h       -o /var/tmp/portage/glibc-2.3.5-r1/work/build-default-i686-pc-linux-gnu-linuxthreads/wctype/wctrans_l.o -MD -MP -MF /var/tmp/portage/glibc-2.3.5-r1/work/build-default-i686-pc-linux-gnu-linuxthreads/wctype/wctrans_l.o.dt -MT /var/tmp/portage/glibc-2.3.5-r1/work/build-default-i686-pc-linux-gnu-linuxthreads/wctype/wctrans_l.o
make[2]: *** [/var/tmp/portage/glibc-2.3.5-r1/work/build-default-i686-pc-linux-gnu-linuxthreads/wctype/wctrans_l.o] Segmentation fault
make[2]: Leaving directory `/var/tmp/portage/glibc-2.3.5-r1/work/glibc-2.3.5/wctype'
make[1]: *** [wctype/subdir_lib] Error 2
make[1]: Leaving directory `/var/tmp/portage/glibc-2.3.5-r1/work/glibc-2.3.5'
make: *** [all] Error 2

!!! ERROR: sys-libs/glibc-2.3.5-r1 failed.
!!! Function toolchain-glibc_src_compile, Line 226, Exitcode 2
!!! (no error message)
!!! If you need support, post the topmost build error, NOT this status message.