All pastes #225988 Raw Edit

Mine

public text v1 · immutable
#225988 ·published 2006-10-28 07:22 UTC
rendered paste body
adams-imac-g5:~/Desktop/mod_perl-2.0.2 adam$ make test TEST_VERBOSE=1 TEST_FILES="t/apache/content_length_header.t t/api/status.t"
cd "src/modules/perl" && make
make[1]: Nothing to be done for `all'.
/usr/bin/perl -Iblib/arch -Iblib/lib \
t/TEST -clean
[warning] setting ulimit to allow core files
ulimit -c unlimited; /usr/bin/perl /Users/adam/Desktop/mod_perl-2.0.2/t/TEST -clean
APACHE_TEST_GROUP= APACHE_TEST_HTTPD= APACHE_TEST_PORT= APACHE_TEST_USER= APACHE_TEST_APXS= \
/usr/bin/perl -Iblib/arch -Iblib/lib \
t/TEST -bugreport -verbose=1 t/apache/content_length_header.t t/api/status.t
[warning] setting ulimit to allow core files
ulimit -c unlimited; /usr/bin/perl /Users/adam/Desktop/mod_perl-2.0.2/t/TEST -bugreport -verbose=1 't/apache/content_length_header.t' 't/api/status.t'
/usr/local/apache2/bin/httpd  -d /Users/adam/Desktop/mod_perl-2.0.2/t -f /Users/adam/Desktop/mod_perl-2.0.2/t/conf/httpd.conf -D APACHE2 -D PERL_USEITHREADS
using Apache/2.2.3 (prefork MPM)

waiting 120 seconds for server to start: .[Sat Oct 28 03:17:29 2006] [info] 6 Apache2:: modules loaded
[Sat Oct 28 03:17:29 2006] [info] 0 APR:: modules loaded
[Sat Oct 28 03:17:29 2006] [info] base server + 27 vhosts ready to run tests
........
waiting 120 seconds for server to start: ok (waited 8 secs)
server localhost:8529 started
server localhost:8530 listening (filter_out_apache)
server localhost:8531 listening (TestModperl::merge)
server localhost:8532 listening (TestModperl::perl_options)
server localhost:8533 listening (TestModperl::setupenv)
server localhost:8534 listening (TestModules::proxy)
server localhost:8535 listening (TestUser::rewrite)
server localhost:8536 listening (TestVhost::config)
server localhost:8537 listening (TestVhost::log)
server localhost:8538 listening (TestProtocol::echo_bbs)
server localhost:8539 listening (TestProtocol::echo_bbs2)
server localhost:8540 listening (TestProtocol::echo_block)
server localhost:8541 listening (TestProtocol::echo_filter)
server localhost:8542 listening (TestProtocol::echo_nonblock)
server localhost:8543 listening (TestProtocol::echo_timeout)
server localhost:8544 listening (TestProtocol::pseudo_http)
server localhost:8545 listening (TestPreConnection::note)
server localhost:8546 listening (TestHooks::hookrun)
server localhost:8547 listening (TestHooks::init)
server localhost:8548 listening (TestHooks::stacked_handlers2)
server localhost:8549 listening (TestHooks::startup)
server localhost:8550 listening (TestHooks::trans)
server localhost:8551 listening (TestFilter::both_str_con_add)
server localhost:8552 listening (TestFilter::in_bbs_inject_header)
server localhost:8553 listening (TestFilter::in_bbs_msg)
server localhost:8554 listening (TestFilter::in_str_msg)
server localhost:8555 listening (TestDirective::perlmodule)
server localhost:8556 listening (TestDirective::perlrequire)
server localhost:8557 listening (TestDirective::perlloadmodule3)
server localhost:8558 listening (TestDirective::perlloadmodule4)
server localhost:8559 listening (TestDirective::perlloadmodule5)
server localhost:8560 listening (TestDirective::perlloadmodule6)
server localhost:8561 listening (TestHooks::push_handlers_anon)
t/apache/content_length_header....1..27
# Running under perl version 5.008006 for darwin
# Current time local: Sat Oct 28 03:17:38 2006
# Current time GMT:   Sat Oct 28 07:17:38 2006
# Using Test.pm version 1.25
# Using Apache/Test.pm version 1.27
# testing : GET /TestApache__content_length_header code
# expected: 200
# received: 200
ok 1
# testing : GET /TestApache__content_length_header C-L header
# expected: 0
# received: 0
ok 2
# testing : GET /TestApache__content_length_header content
# expected: 
# received: 
ok 3
# testing : GET /TestApache__content_length_header?set_content_length code
# expected: 200
# received: 200
ok 4
# testing : GET /TestApache__content_length_header?set_content_length C-L header
# expected: 0
# received: 0
ok 5
# testing : GET /TestApache__content_length_header?set_content_length content
# expected: 
# received: 
ok 6
# testing : GET /TestApache__content_length_header?send_body code
# expected: 200
# received: 200
ok 7
# testing : GET /TestApache__content_length_header?send_body C-L header
# expected: undef
# received: undef
ok 8
# testing : GET /TestApache__content_length_header?send_body content
# expected: This is a response string
# received: This is a response string
ok 9
# testing : GET /TestApache__content_length_header?send_body+set_content_length code
# expected: 200
# received: 200
ok 10
# testing : GET /TestApache__content_length_header?send_body+set_content_length C-L header
# expected: 25
# received: 25
ok 11
# testing : GET /TestApache__content_length_header?send_body+set_content_length content
# expected: This is a response string
# received: This is a response string
ok 12
# testing : HEAD /TestApache__content_length_header code
# expected: 200
# received: 200
ok 13
# testing : HEAD /TestApache__content_length_header C-L header
# expected: undef
# received: undef
ok 14
# testing : HEAD /TestApache__content_length_header content
# expected: 
# received: 
ok 15
# testing : HEAD /TestApache__content_length_header?set_content_length code
# expected: 200
# received: 200
ok 16
# testing : HEAD /TestApache__content_length_header?set_content_length C-L header
# expected: undef
# received: 25
not ok 17
# Failed test 17 in t/apache/content_length_header.t at line 71 fail #2
# testing : HEAD /TestApache__content_length_header?set_content_length content
# expected: 
# received: 
ok 18
# testing : HEAD /TestApache__content_length_header?send_body code
# expected: 200
# received: 200
ok 19
# testing : HEAD /TestApache__content_length_header?send_body C-L header
# expected: undef
# received: undef
ok 20
# testing : HEAD /TestApache__content_length_header?send_body content
# expected: 
# received: 
ok 21
# testing : HEAD /TestApache__content_length_header?send_body+set_content_length code
# expected: 200
# received: 200
ok 22
# testing : HEAD /TestApache__content_length_header?send_body+set_content_length C-L header
# expected: 25
# received: 25
ok 23
# testing : HEAD /TestApache__content_length_header?send_body+set_content_length content
# expected: 
# received: 
ok 24
# testing : HEAD /TestApache__content_length_header?head_no_body+set_content_length code
# expected: 200
# received: 200
ok 25
# testing : HEAD /TestApache__content_length_header?head_no_body+set_content_length C-L header
# expected: 25
# received: 25
ok 26
# testing : HEAD /TestApache__content_length_header?head_no_body+set_content_length content
# expected: 
# received: 
ok 27
FAILED test 17
        Failed 1/27 tests, 96.30% okay
t/api/status......................1..6
# Running under perl version 5.008006 for darwin
# Current time local: Sat Oct 28 03:17:40 2006
# Current time GMT:   Sat Oct 28 07:17:40 2006
# Using Test.pm version 1.25
# Using Apache/Test.pm version 1.27
# testing : code
# expected: 303
# received: 303
ok 1
# testing : code message
# expected: See Other
# received: See Other
ok 2
# testing : content
# expected: 
# received: 
ok 3
# testing : code
# expected: 499
# received: 200
not ok 4
# Failed test 4 in t/api/status.t at line 35
# testing : code message
# expected: FooBared
# received: OK
not ok 5
# Failed test 5 in t/api/status.t at line 36
# testing : content
# expected: 
# received: 
ok 6
FAILED tests 4-5
        Failed 2/6 tests, 66.67% okay
Failed Test                      Stat Wstat Total Fail  Failed  List of Failed
-------------------------------------------------------------------------------
t/apache/content_length_header.t               27    1   3.70%  17
t/api/status.t                                  6    2  33.33%  4-5
Failed 2/2 test scripts, 0.00% okay. 3/33 subtests failed, 90.91% okay.
[warning] server localhost:8529 shutdown
[  error] error running tests (please examine t/logs/error_log)
+--------------------------------------------------------+
| Please file a bug report: http://perl.apache.org/bugs/ |
+--------------------------------------------------------+
make: *** [run_tests] Error 1