rendered paste bodymake[3]: Entering directory `/var/tmp/portage/bind-9.2.5-r4/work/bind-9.2.5/bin/tests/system'
making all in /var/tmp/portage/bind-9.2.5-r4/work/bind-9.2.5/bin/tests/system/lwresd
make[4]: Entering directory `/var/tmp/portage/bind-9.2.5-r4/work/bind-9.2.5/bin/tests/system/lwresd'
make[4]: Leaving directory `/var/tmp/portage/bind-9.2.5-r4/work/bind-9.2.5/bin/tests/system/lwresd'
making all in /var/tmp/portage/bind-9.2.5-r4/work/bind-9.2.5/bin/tests/system/tkey
make[4]: Entering directory `/var/tmp/portage/bind-9.2.5-r4/work/bind-9.2.5/bin/tests/system/tkey'
make[4]: Leaving directory `/var/tmp/portage/bind-9.2.5-r4/work/bind-9.2.5/bin/tests/system/tkey'
make[3]: Leaving directory `/var/tmp/portage/bind-9.2.5-r4/work/bind-9.2.5/bin/tests/system'
making install in /var/tmp/portage/bind-9.2.5-r4/work/bind-9.2.5/bin/tests/db
make[3]: Entering directory `/var/tmp/portage/bind-9.2.5-r4/work/bind-9.2.5/bin/tests/db'
make[3]: Leaving directory `/var/tmp/portage/bind-9.2.5-r4/work/bind-9.2.5/bin/tests/db'
making install in /var/tmp/portage/bind-9.2.5-r4/work/bind-9.2.5/bin/tests/dst
make[3]: Entering directory `/var/tmp/portage/bind-9.2.5-r4/work/bind-9.2.5/bin/tests/dst'
make[3]: Leaving directory `/var/tmp/portage/bind-9.2.5-r4/work/bind-9.2.5/bin/tests/dst'
making install in /var/tmp/portage/bind-9.2.5-r4/work/bind-9.2.5/bin/tests/master
make[3]: Entering directory `/var/tmp/portage/bind-9.2.5-r4/work/bind-9.2.5/bin/tests/master'
make[3]: Leaving directory `/var/tmp/portage/bind-9.2.5-r4/work/bind-9.2.5/bin/tests/master'
making install in /var/tmp/portage/bind-9.2.5-r4/work/bind-9.2.5/bin/tests/mem
make[3]: Entering directory `/var/tmp/portage/bind-9.2.5-r4/work/bind-9.2.5/bin/tests/mem'
make[3]: Leaving directory `/var/tmp/portage/bind-9.2.5-r4/work/bind-9.2.5/bin/tests/mem'
making install in /var/tmp/portage/bind-9.2.5-r4/work/bind-9.2.5/bin/tests/names
make[3]: Entering directory `/var/tmp/portage/bind-9.2.5-r4/work/bind-9.2.5/bin/tests/names'
Inconsistency detected by ld.so: rtld.c: 1075: dl_main: Assertion `_rtld_local._dl_rtld_map.l_libname' failed!
make[3]: *** [install] Error 127
make[3]: Leaving directory `/var/tmp/portage/bind-9.2.5-r4/work/bind-9.2.5/bin/tests/names'
make[2]: *** [install] Error 1
make[2]: Leaving directory `/var/tmp/portage/bind-9.2.5-r4/work/bind-9.2.5/bin/tests'
make[1]: *** [install] Error 1
make[1]: Leaving directory `/var/tmp/portage/bind-9.2.5-r4/work/bind-9.2.5/bin'
make: *** [install] Error 1
!!! ERROR: net-dns/bind-9.2.5-r4 failed.
!!! Function einstall, Line 524, Exitcode 2
!!! einstall failed
!!! If you need support, post the topmost build error, NOT this status message.