All pastes #22474 Raw Edit

Someone

public text v1 · immutable
#22474 ·published 2005-09-09 09:21 UTC
rendered paste body
NOTE: make -e -C irattach
make: Entering directory `/opt/oe/build/oetmp/work/irda-utils-0.9.16-r2/irda-utils-0.9.16/irattach'
ccache arm-linux-gcc -march=armv5te -mtune=xscale -I/opt/oe/build/oetmp/staging/arm-linux/include -fexpensive-optimizations -fomit-frame-pointer -frename-registers -O2 -I/usr/include -I../include/ -c irattach.c
In file included from /opt/oe/build/oetmp/staging/arm-linux/include/_G_config.h:44,
                 from /opt/oe/build/oetmp/staging/arm-linux/include/libio.h:32,
                 from /opt/oe/build/oetmp/staging/arm-linux/include/stdio.h:72,
                 from irattach.c:27:
/opt/oe/build/oetmp/staging/arm-linux/include/gconv.h:72: error: parse error before "size_t"
/opt/oe/build/oetmp/staging/arm-linux/include/gconv.h:88: error: parse error before "size_t"
/opt/oe/build/oetmp/staging/arm-linux/include/gconv.h:97: error: parse error before "size_t"
/opt/oe/build/oetmp/staging/arm-linux/include/gconv.h:174: error: parse error before "size_t"
/opt/oe/build/oetmp/staging/arm-linux/include/gconv.h:174: warning: no semicolon at end of struct or union
/opt/oe/build/oetmp/staging/arm-linux/include/gconv.h:177: error: parse error before '}' token
/opt/oe/build/oetmp/staging/arm-linux/include/gconv.h:177: warning: data definition has no type or storage class
In file included from /opt/oe/build/oetmp/staging/arm-linux/include/libio.h:32,
                 from /opt/oe/build/oetmp/staging/arm-linux/include/stdio.h:72,
                 from irattach.c:27:
/opt/oe/build/oetmp/staging/arm-linux/include/_G_config.h:47: error: field `__cd' has incomplete type
/opt/oe/build/oetmp/staging/arm-linux/include/_G_config.h:50: error: field `__cd' has incomplete type
In file included from /opt/oe/build/oetmp/staging/arm-linux/include/stdio.h:72,
                 from irattach.c:27:
/opt/oe/build/oetmp/staging/arm-linux/include/libio.h:354: error: parse error before "size_t"
/opt/oe/build/oetmp/staging/arm-linux/include/libio.h:363: error: parse error before "size_t"
/opt/oe/build/oetmp/staging/arm-linux/include/libio.h:479: error: parse error before "_IO_sgetn"
/opt/oe/build/oetmp/staging/arm-linux/include/libio.h:479: error: parse error before "size_t"
/opt/oe/build/oetmp/staging/arm-linux/include/libio.h:479: warning: data definition has no type or storage class
In file included from irattach.c:27:
/opt/oe/build/oetmp/staging/arm-linux/include/stdio.h:302: error: parse error before "size_t"
/opt/oe/build/oetmp/staging/arm-linux/include/stdio.h:309: error: parse error before "size_t"
/opt/oe/build/oetmp/staging/arm-linux/include/stdio.h:351: error: parse error before "size_t"
/opt/oe/build/oetmp/staging/arm-linux/include/stdio.h:353: warning: conflicting types for built-in function 'snprintf'
/opt/oe/build/oetmp/staging/arm-linux/include/stdio.h:355: error: parse error before "size_t"
/opt/oe/build/oetmp/staging/arm-linux/include/stdio.h:604: error: parse error before "fread"
/opt/oe/build/oetmp/staging/arm-linux/include/stdio.h:604: error: parse error before "size_t"
/opt/oe/build/oetmp/staging/arm-linux/include/stdio.h:605: warning: data definition has no type or storage class
/opt/oe/build/oetmp/staging/arm-linux/include/stdio.h:610: error: parse error before "fwrite"
/opt/oe/build/oetmp/staging/arm-linux/include/stdio.h:610: error: parse error before "size_t"
/opt/oe/build/oetmp/staging/arm-linux/include/stdio.h:611: warning: conflicting types for built-in function 'fwrite'
/opt/oe/build/oetmp/staging/arm-linux/include/stdio.h:611: warning: data definition has no type or storage class
/opt/oe/build/oetmp/staging/arm-linux/include/stdio.h:632: error: parse error before "fread_unlocked"
/opt/oe/build/oetmp/staging/arm-linux/include/stdio.h:632: error: parse error before "size_t"
/opt/oe/build/oetmp/staging/arm-linux/include/stdio.h:633: warning: data definition has no type or storage class
/opt/oe/build/oetmp/staging/arm-linux/include/stdio.h:634: error: parse error before "fwrite_unlocked"
/opt/oe/build/oetmp/staging/arm-linux/include/stdio.h:634: error: parse error before "size_t"
/opt/oe/build/oetmp/staging/arm-linux/include/stdio.h:635: warning: conflicting types for built-in function 'fwrite_unlocked'
/opt/oe/build/oetmp/staging/arm-linux/include/stdio.h:635: warning: data definition has no type or storage class
In file included from irattach.c:28:
/opt/oe/build/oetmp/staging/arm-linux/include/stdlib.h:140: error: parse error before "__ctype_get_mb_cur_max"
/opt/oe/build/oetmp/staging/arm-linux/include/stdlib.h:140: warning: data definition has no type or storage class
In file included from /opt/oe/build/oetmp/staging/arm-linux/include/sys/types.h:266,
                 from /opt/oe/build/oetmp/staging/arm-linux/include/stdlib.h:436,
                 from irattach.c:28:
/opt/oe/build/oetmp/staging/arm-linux/include/bits/pthreadtypes.h:48: error: parse error before "size_t"
/opt/oe/build/oetmp/staging/arm-linux/include/bits/pthreadtypes.h:48: warning: no semicolon at end of struct or union
/opt/oe/build/oetmp/staging/arm-linux/include/bits/pthreadtypes.h:51: error: parse error before "__stacksize"
/opt/oe/build/oetmp/staging/arm-linux/include/bits/pthreadtypes.h:51: warning: data definition has no type or storage class
/opt/oe/build/oetmp/staging/arm-linux/include/bits/pthreadtypes.h:52: warning: data definition has no type or storage class
In file included from irattach.c:28:
/opt/oe/build/oetmp/staging/arm-linux/include/stdlib.h:453: error: parse error before "size_t"
/opt/oe/build/oetmp/staging/arm-linux/include/stdlib.h:483: error: parse error before "size_t"
/opt/oe/build/oetmp/staging/arm-linux/include/stdlib.h:587: error: parse error before "__size"
/opt/oe/build/oetmp/staging/arm-linux/include/stdlib.h:589: error: parse error before "__nmemb"
/opt/oe/build/oetmp/staging/arm-linux/include/stdlib.h:598: error: parse error before "size_t"
In file included from /opt/oe/build/oetmp/staging/arm-linux/include/stdlib.h:610,
                 from irattach.c:28:
/opt/oe/build/oetmp/staging/arm-linux/include/alloca.h:33: error: parse error before "__size"
In file included from irattach.c:28:
/opt/oe/build/oetmp/staging/arm-linux/include/stdlib.h:615: error: parse error before "__size"
/opt/oe/build/oetmp/staging/arm-linux/include/stdlib.h:774: error: parse error before "size_t"
/opt/oe/build/oetmp/staging/arm-linux/include/stdlib.h:779: error: parse error before "size_t"
/opt/oe/build/oetmp/staging/arm-linux/include/stdlib.h:852: error: parse error before "size_t"
/opt/oe/build/oetmp/staging/arm-linux/include/stdlib.h:855: error: parse error before "size_t"
/opt/oe/build/oetmp/staging/arm-linux/include/stdlib.h:859: error: parse error before "size_t"
/opt/oe/build/oetmp/staging/arm-linux/include/stdlib.h:863: error: parse error before "size_t"
/opt/oe/build/oetmp/staging/arm-linux/include/stdlib.h:872: error: parse error before "size_t"
/opt/oe/build/oetmp/staging/arm-linux/include/stdlib.h:875: error: parse error before '*' token
/opt/oe/build/oetmp/staging/arm-linux/include/stdlib.h:879: error: parse error before "wchar_t"
/opt/oe/build/oetmp/staging/arm-linux/include/stdlib.h:883: error: parse error before "mbstowcs"
/opt/oe/build/oetmp/staging/arm-linux/include/stdlib.h:883: error: parse error before '*' token
/opt/oe/build/oetmp/staging/arm-linux/include/stdlib.h:884: warning: data definition has no type or storage class
/opt/oe/build/oetmp/staging/arm-linux/include/stdlib.h:886: error: parse error before "wcstombs"
/opt/oe/build/oetmp/staging/arm-linux/include/stdlib.h:887: error: parse error before '*' token
/opt/oe/build/oetmp/staging/arm-linux/include/stdlib.h:888: warning: data definition has no type or storage class
In file included from irattach.c:29:
/opt/oe/build/oetmp/staging/arm-linux/include/string.h:39: error: parse error before "size_t"
/opt/oe/build/oetmp/staging/arm-linux/include/string.h:43: error: parse error before "size_t"
/opt/oe/build/oetmp/staging/arm-linux/include/string.h:52: error: parse error before "size_t"
/opt/oe/build/oetmp/staging/arm-linux/include/string.h:59: error: parse error before "size_t"
/opt/oe/build/oetmp/staging/arm-linux/include/string.h:62: error: parse error before "size_t"
/opt/oe/build/oetmp/staging/arm-linux/include/string.h:66: error: parse error before "size_t"
/opt/oe/build/oetmp/staging/arm-linux/include/string.h:88: error: parse error before "size_t"
/opt/oe/build/oetmp/staging/arm-linux/include/string.h:96: error: parse error before "size_t"
/opt/oe/build/oetmp/staging/arm-linux/include/string.h:102: error: parse error before "size_t"
/opt/oe/build/oetmp/staging/arm-linux/include/string.h:109: error: parse error before "strxfrm"
/opt/oe/build/oetmp/staging/arm-linux/include/string.h:110: error: parse error before "size_t"
/opt/oe/build/oetmp/staging/arm-linux/include/string.h:111: warning: data definition has no type or storage class
/opt/oe/build/oetmp/staging/arm-linux/include/string.h:184: error: parse error before "strcspn"
/opt/oe/build/oetmp/staging/arm-linux/include/string.h:185: warning: data definition has no type or storage class
/opt/oe/build/oetmp/staging/arm-linux/include/string.h:188: error: parse error before "strspn"
/opt/oe/build/oetmp/staging/arm-linux/include/string.h:189: warning: data definition has no type or storage class
/opt/oe/build/oetmp/staging/arm-linux/include/string.h:242: error: parse error before "strlen"
/opt/oe/build/oetmp/staging/arm-linux/include/string.h:243: warning: data definition has no type or storage class
/opt/oe/build/oetmp/staging/arm-linux/include/string.h:281: error: parse error before "size_t"
/opt/oe/build/oetmp/staging/arm-linux/include/string.h:288: error: parse error before "size_t"
/opt/oe/build/oetmp/staging/arm-linux/include/string.h:292: error: parse error before "size_t"
/opt/oe/build/oetmp/staging/arm-linux/include/string.h:296: error: parse error before "size_t"
/opt/oe/build/oetmp/staging/arm-linux/include/string.h:299: error: parse error before "size_t"
/opt/oe/build/oetmp/staging/arm-linux/include/string.h:329: error: parse error before "size_t"
In file included from /opt/oe/build/oetmp/staging/arm-linux/include/string.h:417,
                 from irattach.c:29:
/opt/oe/build/oetmp/staging/arm-linux/include/bits/string2.h:969: error: parse error before "__strcspn_c1"
/opt/oe/build/oetmp/staging/arm-linux/include/bits/string2.h:969: warning: data definition has no type or storage class
/opt/oe/build/oetmp/staging/arm-linux/include/bits/string2.h:971: error: parse error before "__strcspn_c1"
/opt/oe/build/oetmp/staging/arm-linux/include/bits/string2.h: In function `__strcspn_c1':
/opt/oe/build/oetmp/staging/arm-linux/include/bits/string2.h:973: error: syntax error before "__result"
/opt/oe/build/oetmp/staging/arm-linux/include/bits/string2.h:974: error: `__result' undeclared (first use in this function)
/opt/oe/build/oetmp/staging/arm-linux/include/bits/string2.h:974: error: (Each undeclared identifier is reported only once
/opt/oe/build/oetmp/staging/arm-linux/include/bits/string2.h:974: error: for each function it appears in.)
/opt/oe/build/oetmp/staging/arm-linux/include/bits/string2.h: At top level:
/opt/oe/build/oetmp/staging/arm-linux/include/bits/string2.h:979: error: parse error before "__strcspn_c2"
/opt/oe/build/oetmp/staging/arm-linux/include/bits/string2.h:980: warning: data definition has no type or storage class
/opt/oe/build/oetmp/staging/arm-linux/include/bits/string2.h:982: error: parse error before "__strcspn_c2"
/opt/oe/build/oetmp/staging/arm-linux/include/bits/string2.h: In function `__strcspn_c2':
/opt/oe/build/oetmp/staging/arm-linux/include/bits/string2.h:984: error: syntax error before "__result"
/opt/oe/build/oetmp/staging/arm-linux/include/bits/string2.h:985: error: `__result' undeclared (first use in this function)
/opt/oe/build/oetmp/staging/arm-linux/include/bits/string2.h: At top level:
/opt/oe/build/oetmp/staging/arm-linux/include/bits/string2.h:991: error: parse error before "__strcspn_c3"
/opt/oe/build/oetmp/staging/arm-linux/include/bits/string2.h:992: warning: data definition has no type or storage class
/opt/oe/build/oetmp/staging/arm-linux/include/bits/string2.h:994: error: parse error before "__strcspn_c3"
/opt/oe/build/oetmp/staging/arm-linux/include/bits/string2.h: In function `__strcspn_c3':
/opt/oe/build/oetmp/staging/arm-linux/include/bits/string2.h:997: error: syntax error before "__result"
/opt/oe/build/oetmp/staging/arm-linux/include/bits/string2.h:998: error: `__result' undeclared (first use in this function)
/opt/oe/build/oetmp/staging/arm-linux/include/bits/string2.h: At top level:
/opt/oe/build/oetmp/staging/arm-linux/include/bits/string2.h:1045: error: parse error before "__strspn_c1"
/opt/oe/build/oetmp/staging/arm-linux/include/bits/string2.h:1045: warning: data definition has no type or storage class
/opt/oe/build/oetmp/staging/arm-linux/include/bits/string2.h:1047: error: parse error before "__strspn_c1"
/opt/oe/build/oetmp/staging/arm-linux/include/bits/string2.h: In function `__strspn_c1':
/opt/oe/build/oetmp/staging/arm-linux/include/bits/string2.h:1049: error: syntax error before "__result"
/opt/oe/build/oetmp/staging/arm-linux/include/bits/string2.h:1051: error: `__result' undeclared (first use in this function)
/opt/oe/build/oetmp/staging/arm-linux/include/bits/string2.h: At top level:
/opt/oe/build/oetmp/staging/arm-linux/include/bits/string2.h:1056: error: parse error before "__strspn_c2"
/opt/oe/build/oetmp/staging/arm-linux/include/bits/string2.h:1057: warning: data definition has no type or storage class
/opt/oe/build/oetmp/staging/arm-linux/include/bits/string2.h:1059: error: parse error before "__strspn_c2"
/opt/oe/build/oetmp/staging/arm-linux/include/bits/string2.h: In function `__strspn_c2':
/opt/oe/build/oetmp/staging/arm-linux/include/bits/string2.h:1061: error: syntax error before "__result"
/opt/oe/build/oetmp/staging/arm-linux/include/bits/string2.h:1063: error: `__result' undeclared (first use in this function)
/opt/oe/build/oetmp/staging/arm-linux/include/bits/string2.h: At top level:
/opt/oe/build/oetmp/staging/arm-linux/include/bits/string2.h:1068: error: parse error before "__strspn_c3"
/opt/oe/build/oetmp/staging/arm-linux/include/bits/string2.h:1069: warning: data definition has no type or storage class
/opt/oe/build/oetmp/staging/arm-linux/include/bits/string2.h:1071: error: parse error before "__strspn_c3"
/opt/oe/build/oetmp/staging/arm-linux/include/bits/string2.h: In function `__strspn_c3':
/opt/oe/build/oetmp/staging/arm-linux/include/bits/string2.h:1073: error: syntax error before "__result"
/opt/oe/build/oetmp/staging/arm-linux/include/bits/string2.h:1075: error: `__result' undeclared (first use in this function)
/opt/oe/build/oetmp/staging/arm-linux/include/bits/string2.h: In function `__strpbrk_c2':
/opt/oe/build/oetmp/staging/arm-linux/include/bits/string2.h:1129: error: `size_t' undeclared (first use in this function)
/opt/oe/build/oetmp/staging/arm-linux/include/bits/string2.h:1129: error: parse error before "__s"
/opt/oe/build/oetmp/staging/arm-linux/include/bits/string2.h: In function `__strpbrk_c3':
/opt/oe/build/oetmp/staging/arm-linux/include/bits/string2.h:1142: error: `size_t' undeclared (first use in this function)
/opt/oe/build/oetmp/staging/arm-linux/include/bits/string2.h:1142: error: parse error before "__s"
/opt/oe/build/oetmp/staging/arm-linux/include/bits/string2.h: At top level:
/opt/oe/build/oetmp/staging/arm-linux/include/bits/string2.h:1323: error: parse error before "size_t"
In file included from /opt/oe/build/oetmp/staging/arm-linux/include/fcntl.h:33,
                 from irattach.c:32:
/opt/oe/build/oetmp/staging/arm-linux/include/bits/fcntl.h:186: error: parse error before "size_t"
In file included from irattach.c:35:
/opt/oe/build/oetmp/staging/arm-linux/include/unistd.h:313: error: parse error before "size_t"
/opt/oe/build/oetmp/staging/arm-linux/include/unistd.h:319: error: parse error before "size_t"
/opt/oe/build/oetmp/staging/arm-linux/include/unistd.h:449: error: parse error before "size_t"
In file included from irattach.c:35:
/opt/oe/build/oetmp/staging/arm-linux/include/unistd.h:546: error: parse error before "confstr"
/opt/oe/build/oetmp/staging/arm-linux/include/unistd.h:546: error: parse error before "size_t"
/opt/oe/build/oetmp/staging/arm-linux/include/unistd.h:546: warning: data definition has no type or storage class
/opt/oe/build/oetmp/staging/arm-linux/include/unistd.h:718: error: parse error before "size_t"
/opt/oe/build/oetmp/staging/arm-linux/include/unistd.h:746: error: parse error before "size_t"
In file included from irattach.c:35:
/opt/oe/build/oetmp/staging/arm-linux/include/unistd.h:797: error: parse error before "size_t"
/opt/oe/build/oetmp/staging/arm-linux/include/unistd.h:804: error: parse error before "size_t"
/opt/oe/build/oetmp/staging/arm-linux/include/unistd.h:815: error: parse error before "size_t"
/opt/oe/build/oetmp/staging/arm-linux/include/unistd.h:817: error: parse error before "size_t"
/opt/oe/build/oetmp/staging/arm-linux/include/unistd.h:835: error: parse error before "size_t"
In file included from /opt/oe/build/oetmp/staging/arm-linux/include/signal.h:348,
                 from irattach.c:36:
/opt/oe/build/oetmp/staging/arm-linux/include/bits/sigstack.h:54: error: parse error before "size_t"
/opt/oe/build/oetmp/staging/arm-linux/include/bits/sigstack.h:54: warning: no semicolon at end of struct or union
/opt/oe/build/oetmp/staging/arm-linux/include/bits/sigstack.h:55: warning: data definition has no type or storage class
In file included from /opt/oe/build/oetmp/staging/arm-linux/include/sys/uio.h:29,
                 from /opt/oe/build/oetmp/staging/arm-linux/include/sys/socket.h:27,
                 from irattach.c:37:
/opt/oe/build/oetmp/staging/arm-linux/include/bits/uio.h:45: error: parse error before "size_t"
/opt/oe/build/oetmp/staging/arm-linux/include/bits/uio.h:45: warning: no semicolon at end of struct or union
In file included from /opt/oe/build/oetmp/staging/arm-linux/include/sys/socket.h:35,
                 from irattach.c:37:
/opt/oe/build/oetmp/staging/arm-linux/include/bits/socket.h:221: error: parse error before "size_t"
/opt/oe/build/oetmp/staging/arm-linux/include/bits/socket.h:221: warning: no semicolon at end of struct or union
/opt/oe/build/oetmp/staging/arm-linux/include/bits/socket.h:224: error: parse error before "msg_controllen"
/opt/oe/build/oetmp/staging/arm-linux/include/bits/socket.h:224: warning: data definition has no type or storage class
/opt/oe/build/oetmp/staging/arm-linux/include/bits/socket.h:227: error: parse error before '}' token
/opt/oe/build/oetmp/staging/arm-linux/include/bits/socket.h:232: error: parse error before "size_t"
/opt/oe/build/oetmp/staging/arm-linux/include/bits/socket.h:232: warning: no semicolon at end of struct or union
/opt/oe/build/oetmp/staging/arm-linux/include/bits/socket.h:239: error: parse error before '}' token
/opt/oe/build/oetmp/staging/arm-linux/include/bits/socket.h: In function `__cmsg_nxthdr':
/opt/oe/build/oetmp/staging/arm-linux/include/bits/socket.h:266: error: `size_t' undeclared (first use in this function)
/opt/oe/build/oetmp/staging/arm-linux/include/bits/socket.h:266: error: parse error before "__cmsg"
/opt/oe/build/oetmp/staging/arm-linux/include/bits/socket.h:271: error: dereferencing pointer to incomplete type
/opt/oe/build/oetmp/staging/arm-linux/include/bits/socket.h:271: error: parse error before '~' token
/opt/oe/build/oetmp/staging/arm-linux/include/bits/socket.h:271: error: parse error before ')' token
/opt/oe/build/oetmp/staging/arm-linux/include/bits/socket.h:272: error: invalid use of undefined type `struct cmsghdr'
/opt/oe/build/oetmp/staging/arm-linux/include/bits/socket.h:272: error: dereferencing pointer to incomplete type
/opt/oe/build/oetmp/staging/arm-linux/include/bits/socket.h:273: error: dereferencing pointer to incomplete type
/opt/oe/build/oetmp/staging/arm-linux/include/bits/socket.h:274: error: dereferencing pointer to incomplete type
/opt/oe/build/oetmp/staging/arm-linux/include/bits/socket.h:274: error: parse error before '~' token
/opt/oe/build/oetmp/staging/arm-linux/include/bits/socket.h:275: error: parse error before '>' token
In file included from irattach.c:37:
/opt/oe/build/oetmp/staging/arm-linux/include/sys/socket.h: At top level:
/opt/oe/build/oetmp/staging/arm-linux/include/sys/socket.h:136: error: parse error before "size_t"
/opt/oe/build/oetmp/staging/arm-linux/include/sys/socket.h:143: error: parse error before "size_t"
/opt/oe/build/oetmp/staging/arm-linux/include/sys/socket.h:150: error: parse error before "size_t"
/opt/oe/build/oetmp/staging/arm-linux/include/sys/socket.h:161: error: parse error before "size_t"
In file included from irattach.c:42:
/usr/include/irda.h:125: error: parse error before "__u8"
/usr/include/irda.h:125: warning: no semicolon at end of struct or union
/usr/include/irda.h:126: warning: data definition has no type or storage class
/usr/include/irda.h:128: error: parse error before '}' token
/usr/include/irda.h:131: error: parse error before "__u32"
/usr/include/irda.h:131: warning: no semicolon at end of struct or union
/usr/include/irda.h:132: warning: data definition has no type or storage class
/usr/include/irda.h:134: error: parse error before "charset"
/usr/include/irda.h:134: warning: data definition has no type or storage class
/usr/include/irda.h:135: error: parse error before "hints"
/usr/include/irda.h:135: warning: data definition has no type or storage class
/usr/include/irda.h:136: error: parse error before '}' token
/usr/include/irda.h:139: error: parse error before "__u32"
/usr/include/irda.h:139: warning: no semicolon at end of struct or union
/usr/include/irda.h:141: error: parse error before '}' token
/usr/include/irda.h:151: error: parse error before "__u8"
/usr/include/irda.h:151: warning: no semicolon at end of struct or union
/usr/include/irda.h:151: warning: no semicolon at end of struct or union
/usr/include/irda.h:151: warning: no semicolon at end of struct or union
/usr/include/irda.h:152: warning: data definition has no type or storage class
/usr/include/irda.h:154: error: parse error before "__u8"
/usr/include/irda.h:154: warning: no semicolon at end of struct or union
/usr/include/irda.h:155: warning: data definition has no type or storage class
/usr/include/irda.h:156: error: parse error before "string"
/usr/include/irda.h:156: warning: data definition has no type or storage class
/usr/include/irda.h:157: error: parse error before '}' token
/usr/include/irda.h:157: warning: data definition has no type or storage class
/usr/include/irda.h:158: error: parse error before '}' token
/usr/include/irda.h:158: warning: data definition has no type or storage class
/usr/include/irda.h:159: error: parse error before "daddr"
/usr/include/irda.h:159: warning: data definition has no type or storage class
/usr/include/irda.h:190: error: parse error before "__u8"
/usr/include/irda.h:190: warning: no semicolon at end of struct or union
/usr/include/irda.h:191: warning: data definition has no type or storage class
/usr/include/irda.h:202: error: field `ifru_line' has incomplete type
irattach.c:83: error: conflicting types for 'info'
/usr/include/irda.h:133: error: previous declaration of 'info' was here
irattach.c: In function `get_irdevname':
irattach.c:287: error: `size_t' undeclared (first use in this function)
irattach.c:287: error: parse error before "__s1_len"
irattach.c:287: error: `__s1_len' undeclared (first use in this function)
irattach.c:287: error: `__s2_len' undeclared (first use in this function)
irattach.c:287: error: parse error before "const"
irattach.c:287: error: parse error before "const"
irattach.c:287: error: parse error before "const"
irattach.c:287: error: parse error before "const"
irattach.c:287: error: parse error before ')' token
irattach.c:287: error: `__s2' undeclared (first use in this function)
irattach.c:287: error: parse error before ')' token
irattach.c:287: error: `__s1' undeclared (first use in this function)
irattach.c: At top level:
irattach.c:287: error: parse error before ')' token
irattach.c:290: error: `buf' undeclared here (not in a function)
irattach.c:290: warning: initialization makes integer from pointer without a cast
irattach.c:290: error: initializer element is not constant
irattach.c:290: warning: data definition has no type or storage class
irattach.c:293: error: parse error before "if"
irattach.c:297: error: parse error before '(' token
irattach.c:298: warning: data definition has no type or storage class
irattach.c:300: error: parse error before "return"
irattach.c: In function `get_module_devices':
irattach.c:387: error: `size_t' undeclared (first use in this function)
irattach.c:387: error: parse error before "__s1_len"
irattach.c:387: error: `__s1_len' undeclared (first use in this function)
irattach.c:387: error: `__s2_len' undeclared (first use in this function)
irattach.c:387: error: parse error before "const"
irattach.c:387: error: parse error before "const"
irattach.c:387: error: parse error before "const"
irattach.c:387: error: parse error before "const"
irattach.c:387: error: parse error before ')' token
irattach.c:387: error: `__s2' undeclared (first use in this function)
irattach.c:387: error: parse error before ')' token
irattach.c:387: error: `__s1' undeclared (first use in this function)
irattach.c:387: error: parse error before ')' token
irattach.c: At top level:
irattach.c:399: error: initializer element is not constant
irattach.c:399: warning: data definition has no type or storage class
irattach.c:401: error: parse error before "if"
irattach.c:413: error: parse error before '[' token
irattach.c:413: error: conflicting types for 'strcpy'
irattach.c:413: error: conflicting types for 'strcpy'
irattach.c:413: warning: data definition has no type or storage class
irattach.c:414: error: parse error before string constant
irattach.c:415: error: conflicting types for 'fprintf'
irattach.c:415: note: a parameter list with an ellipsis can't match an empty parameter name list declaration
irattach.c:415: error: conflicting types for 'fprintf'
irattach.c:415: note: a parameter list with an ellipsis can't match an empty parameter name list declaration
irattach.c:415: warning: data definition has no type or storage class
irattach.c: In function `get_dongle':
irattach.c:638: error: `size_t' undeclared (first use in this function)
irattach.c:638: error: parse error before "__s1_len"
irattach.c:638: error: `__s1_len' undeclared (first use in this function)
irattach.c:638: error: `__s2_len' undeclared (first use in this function)
irattach.c:638: error: parse error before "const"
irattach.c:638: error: parse error before "const"
irattach.c:638: error: parse error before "const"
irattach.c:638: error: parse error before "const"
irattach.c:638: error: parse error before ')' token
irattach.c:638: error: `__s2' undeclared (first use in this function)
irattach.c:638: error: parse error before ')' token
irattach.c:638: error: `__s1' undeclared (first use in this function)
irattach.c:638: error: parse error before ')' token
irattach.c: In function `main':
irattach.c:704: error: `size_t' undeclared (first use in this function)
irattach.c:704: error: parse error before "__s1_len"
irattach.c:704: error: `__s1_len' undeclared (first use in this function)
irattach.c:704: error: `__s2_len' undeclared (first use in this function)
irattach.c:704: error: parse error before "const"
irattach.c:704: error: parse error before "const"
irattach.c:704: error: parse error before "const"
irattach.c:704: error: parse error before "const"
irattach.c:704: error: parse error before ')' token
irattach.c:704: error: `__s2' undeclared (first use in this function)
irattach.c:704: error: parse error before ')' token
irattach.c:704: error: `__s1' undeclared (first use in this function)
irattach.c: At top level:
irattach.c:704: error: parse error before ')' token
irattach.c:709: error: redefinition of 'devfd'
irattach.c:63: error: previous definition of 'devfd' was here
irattach.c:709: error: initializer element is not constant
irattach.c:709: warning: data definition has no type or storage class
irattach.c:710: error: parse error before '}' token
irattach.c:712: error: parse error before string constant
irattach.c:712: error: `__s2' undeclared here (not in a function)
irattach.c:712: error: parse error before "if"
irattach.c:712: error: non-static declaration of '__result' follows static declaration
irattach.c:712: error: previous definition of '__result' was here
irattach.c:712: warning: data definition has no type or storage class
irattach.c:712: error: parse error before '}' token
irattach.c:712: error: static declaration of '__result' follows non-static declaration
irattach.c:712: error: previous declaration of '__result' was here
irattach.c:712: error: static declaration of '__result' follows non-static declaration
irattach.c:712: error: previous declaration of '__result' was here
irattach.c:712: error: `__s1' undeclared here (not in a function)
irattach.c:712: error: parse error before "if"
irattach.c:712: error: non-static declaration of '__result' follows static declaration
irattach.c:712: error: previous definition of '__result' was here
irattach.c:712: warning: data definition has no type or storage class
irattach.c:712: error: parse error before '}' token
irattach.c:724: warning: parameter names (without types) in function declaration
irattach.c:724: warning: data definition has no type or storage class
irattach.c:725: error: parse error before '}' token
irattach.c:729: warning: parameter names (without types) in function declaration
irattach.c:729: error: conflicting types for 'fork_now'
irattach.c:53: error: previous declaration of 'fork_now' was here
irattach.c:729: error: conflicting types for 'fork_now'
irattach.c:53: error: previous declaration of 'fork_now' was here
irattach.c:729: warning: data definition has no type or storage class
irattach.c:737: error: parse error before "if"
irattach.c:753: error: parse error before '-' token
irattach.c:753: error: conflicting types for 'clean_exit'
irattach.c:234: error: previous definition of 'clean_exit' was here
irattach.c:753: warning: data definition has no type or storage class
irattach.c:755: error: parse error before '.' token
irattach.c:755: warning: data definition has no type or storage class
irattach.c:778: error: initializer element is not constant
irattach.c:778: warning: data definition has no type or storage class
irattach.c:779: error: parse error before "if"
/opt/oe/build/oetmp/staging/arm-linux/include/gconv.h:176: warning: array '__data' assumed to have one element
/opt/oe/build/oetmp/staging/arm-linux/include/bits/socket.h:237: warning: array '__cmsg_data' assumed to have one element
/usr/include/irda.h:140: error: storage size of `dev' isn't known
irattach.c:298: error: storage size of `name' isn't known
make: *** [irattach.o] Error 1
make: Leaving directory `/opt/oe/build/oetmp/work/irda-utils-0.9.16-r2/irda-utils-0.9.16/irattach'
FATAL: oe_runmake failed