All pastes #22473 Raw Edit

config.log

public text v1 · immutable
#22473 ·published 2005-09-09 09:11 UTC
rendered paste body
This file contains any messages produced by compilers while
running configure, to aid debugging if configure makes a mistake.

It was created by fixincludes configure  , which was
generated by GNU Autoconf 2.59.  Invocation command line was

  $ /home/raphael/devel/zaurus/bitbake/tmp/work/gcc-cross-4.0.0-r1/gcc-4.0.0/fixincludes/configure --cache-file=./config.cache --build=i686-linux --host=i686-linux --target=arm-linux --prefix=/home/raphael/devel/zaurus/bitbake/tmp/cross --exec_prefix=/home/raphael/devel/zaurus/bitbake/tmp/cross --bindir=/home/raphael/devel/zaurus/bitbake/tmp/cross/bin --sbindir=/home/raphael/devel/zaurus/bitbake/tmp/cross/bin --libexecdir=/home/raphael/devel/zaurus/bitbake/tmp/cross/libexec --datadir=/home/raphael/devel/zaurus/bitbake/tmp/cross/share --sysconfdir=/home/raphael/devel/zaurus/bitbake/tmp/cross/etc --sharedstatedir=/home/raphael/devel/zaurus/bitbake/tmp/cross/com --localstatedir=/home/raphael/devel/zaurus/bitbake/tmp/cross/var --libdir=/home/raphael/devel/zaurus/bitbake/tmp/cross/lib --includedir=/home/raphael/devel/zaurus/bitbake/tmp/cross/include --oldincludedir=/home/raphael/devel/zaurus/bitbake/tmp/cross/include --infodir=/home/raphael/devel/zaurus/bitbake/tmp/cross/share/info --mandir=/home/raphael/devel/zaurus/bitbake/tmp/cross/share/man --with-gnu-ld --enable-shared --enable-target-optspace --enable-threads=posix --enable-multilib --enable-c99 --enable-long-long --enable-symvers=gnu --enable-libstdcxx-pch --with-local-prefix=/home/raphael/devel/zaurus/bitbake/tmp/cross/arm-linux --with-gxx-include-dir=/home/raphael/devel/zaurus/bitbake/tmp/cross/arm-linux/include/c++ --enable-__cxa_atexit --with-float=soft --with-gcc-version-trigger=/home/raphael/devel/zaurus/bitbake/tmp/work/gcc-cross-4.0.0-r1/gcc-4.0.0/gcc/version.c --enable-languages=c,c++,f95 --program-transform-name=s,^,arm-linux-,;  --srcdir=/home/raphael/devel/zaurus/bitbake/tmp/work/gcc-cross-4.0.0-r1/gcc-4.0.0/fixincludes

## --------- ##
## Platform. ##
## --------- ##

hostname = TOKK
uname -m = i686
uname -r = 2.6.11.050617
uname -s = Linux
uname -v = #1 Thu Jun 16 22:32:43 CEST 2005

/usr/bin/uname -p = unknown
/bin/uname -X     = unknown

/bin/arch              = i686
/usr/bin/arch -k       = unknown
/usr/convex/getsysinfo = unknown
hostinfo               = unknown
/bin/machine           = unknown
/usr/bin/oslevel       = unknown
/bin/universe          = unknown

PATH: /home/raphael/devel/zaurus/bitbake/tmp/staging/i686-linux/bin/i686-linux
PATH: /home/raphael/devel/zaurus/bitbake/tmp/staging/i686-linux/bin
PATH: /home/raphael/devel/zaurus/bitbake/tmp/cross/bin
PATH: /home/raphael/.dist/bin
PATH: /sbin
PATH: /bin
PATH: /usr/sbin
PATH: /usr/bin
PATH: /usr/X11R6/bin
PATH: /usr/local/sbin
PATH: /usr/local/bin
PATH: /usr/games
PATH: .
PATH: ~/devel/zaurus/bitbake/bin/


## ----------- ##
## Core tests. ##
## ----------- ##

configure:1209: loading site script /home/raphael/devel/zaurus/org.openembedded.dev/site/i686-linux
| ac_cv_c_bigendian=${ac_cv_c_bigendian=no}
| ac_cv_func_getpgrp_void=${ac_cv_func_getpgrp_void=yes}
| ac_cv_func_getpwuid_r=${ac_cv_func_getpwuid_r=yes}
| ac_cv_func_lstat_dereferences_slashed_symlink=${ac_cv_func_lstat_dereferences_slashed_symlink=yes}
| ac_cv_func_lstat_empty_string_bug=${ac_cv_func_lstat_empty_string_bug=no}
| ac_cv_func_malloc_0_nonnull=${ac_cv_func_malloc_0_nonnull=yes}
| ac_cv_func_pthread_key_delete=${ac_cv_func_pthread_key_delete=yes}
| ac_cv_func_setpgrp_void=${ac_cv_func_setpgrp_void=yes}
| ac_cv_func_setvbuf_reversed=${ac_cv_func_setvbuf_reversed=no}
| ac_cv_func_stat_empty_string_bug=${ac_cv_func_stat_empty_string_bug=no}
| ac_cv_header_netinet_sctp_h=${ac_cv_header_netinet_sctp_h=no}
| ac_cv_header_netinet_sctp_uio_h=${ac_cv_header_netinet_sctp_uio_h=no}
| ac_cv_linux_vers=${ac_cv_linux_vers=2}
| ac_cv_sctp=${ac_cv_sctp=no}
| ac_cv_sizeof_char=${ac_cv_sizeof_char=1}
| ac_cv_sizeof_char_p=${ac_cv_sizeof_char_p=4}
| ac_cv_sizeof_int=${ac_cv_sizeof_int=4}
| ac_cv_sizeof_long=${ac_cv_sizeof_long=4}
| ac_cv_sizeof_long_long=${ac_cv_sizeof_long_long=8}
| ac_cv_sizeof_short=${ac_cv_sizeof_short=2}
| ac_cv_sizeof_size_t=${ac_cv_sizeof_size_t=4}
| ac_cv_sizeof_ssize_t=${ac_cv_sizeof_ssize_t=4}
| ac_cv_sizeof_void_p=${ac_cv_sizeof_void_p=4}
| ac_cv_sizeof_float=${ac_cv_sizeof_float=4}
| apr_cv_process_shared_works=${apr_cv_process_shared_works=no}
| bash_cv_have_mbstate_t=${bash_cv_have_mbstate_t=yes}
| db_cv_alignp_t=${db_cv_alignp_t='unsigned long'}
| db_cv_align_t=${db_cv_align_t='unsigned long long'}
| db_cv_fcntl_f_setfd=${db_cv_fcntl_f_setfd=yes}
| db_cv_mutex=${db_cv_mutex=x86/gcc-assembly}
| db_cv_path_ar=${db_cv_path_ar=/usr/bin/ar}
| db_cv_path_chmod=${db_cv_path_chmod=/bin/chmod}
| db_cv_path_cp=${db_cv_path_cp=/bin/cp}
| db_cv_path_ln=${db_cv_path_ln=/bin/ln}
| db_cv_path_mkdir=${db_cv_path_mkdir=/bin/mkdir}
| db_cv_path_ranlib=${db_cv_path_ranlib=/usr/bin/ranlib}
| db_cv_path_rm=${db_cv_path_rm=/bin/rm}
| db_cv_path_sh=${db_cv_path_sh=/bin/sh}
| db_cv_path_strip=${db_cv_path_strip=/usr/bin/strip}
| db_cv_posixmutexes=${db_cv_posixmutexes=no}
| db_cv_sprintf_count=${db_cv_sprintf_count=yes}
| db_cv_uimutexes=${db_cv_uimutexes=no}
| glib_cv_has__inline=${glib_cv_has__inline=yes}
| glib_cv_has__inline__=${glib_cv_has__inline__=yes}
| glib_cv_hasinline=${glib_cv_hasinline=yes}
| glib_cv_sane_realloc=${glib_cv_sane_realloc=yes}
| glib_cv_sizeof_gmutex=${glib_cv_sizeof_gmutex=24}
| glib_cv_sys_pthread_cond_timedwait_posix=${glib_cv_sys_pthread_cond_timedwait_posix=yes}
| glib_cv_sys_pthread_getspecific_posix=${glib_cv_sys_pthread_getspecific_posix=yes}
| glib_cv_sys_pthread_mutex_trylock_posix=${glib_cv_sys_pthread_mutex_trylock_posix=yes}
| glib_cv_uscore=${glib_cv_uscore=no}
| glib_cv___va_copy=${glib_cv___va_copy=yes}
| glib_cv_va_copy=${glib_cv_va_copy=yes}
| glib_cv_va_val_copy=${glib_cv_va_val_copy=yes}
| utils_cv_sys_open_max=${utils_cv_sys_open_max=1015}
| 
| # glib-2.0
| glib_cv_stack_grows=${glib_cv_stack_grows=no}
| ac_cv_func_posix_getpwuid_r=${ac_cv_func_posix_getpwuid_r=yes}
| glib_cv_use_pid_surrogate=${glib_cv_use_pid_surrogate=yes}
| 
| # jikes-native
| ac_cv_sizeof_wchar_t=4
| 
| # startup-notification
| lf_cv_sane_realloc=yes
| 
| # libidl
| libIDL_cv_long_long_format=${libIDL_cv_long_long_format=ll}
| 
| # ORBit2
| ac_cv_alignof_CORBA_boolean=1
| ac_cv_alignof_CORBA_char=1
| ac_cv_alignof_CORBA_double=4
| ac_cv_alignof_CORBA_float=4
| ac_cv_alignof_CORBA_long=4
| ac_cv_alignof_CORBA_long_double=4
| ac_cv_alignof_CORBA_long_long=4
| ac_cv_alignof_CORBA_octet=1
| ac_cv_alignof_CORBA_pointer=4
| ac_cv_alignof_CORBA_short=2
| ac_cv_alignof_CORBA_struct=4
| ac_cv_alignof_CORBA_wchar=2
| ac_cv_func_getaddrinfo=${ac_cv_func_getaddrinfo=yes}
| 
| # D-BUS
| ac_cv_func_posix_getpwnam_r=${ac_cv_func_posix_getpwnam_r=yes}
| 
| # mysql
| mysql_cv_func_atomic_sub=${mysql_cv_func_atomic_sub=yes}
| mysql_cv_func_atomic_add=${mysql_cv_func_atomic_add=yes}
| ac_cv_conv_longlong_to_float=${ac_cv_conv_longlong_to_float=yes}
| 
| ac_cv_sys_restartable_syscalls=yes
| ac_cv_uchar=${ac_cv_uchar=no}
| ac_cv_uint=${ac_cv_uint=yes}
| ac_cv_ulong=${ac_cv_ulong=yes}
| ac_cv_ushort=${ac_cv_ushort=yes}
| 
| # samba
| samba_cv_HAVE_GETTIMEOFDAY_TZ=${samba_cv_HAVE_GETTIMEOFDAY_TZ=yes}
| 
| # gettext
| am_cv_func_working_getline=${am_cv_func_working_getline=yes}
| 
| # cvs
| cvs_cv_func_printf_ptr=${cvs_cv_func_printf_ptr=yes}
| 
| # bash
| ac_cv_c_long_double=${ac_cv_c_long_double=yes}
| bash_cv_have_mbstate_t=${bash_cv_have_mbstate_t=yes}
| bash_cv_func_sigsetjmp=${bash_cv_func_sigsetjmp=missing}
| bash_cv_must_reinstall_sighandlers=${bash_cv_must_reinstall_sighandlers=no}
| bash_cv_func_strcoll_broken=${bash_cv_func_strcoll_broken=no}
| bash_cv_under_sys_siglist=${bash_cv_under_sys_siglist=yes}
| bash_cv_sys_siglist=${bash_cv_sys_siglist=yes}
| bash_cv_dup2_broken=${bash_cv_dup2_broken=no}
| bash_cv_opendir_not_robust=${bash_cv_opendir_not_robust=no}
| bash_cv_type_rlimit=${bash_cv_type_rlimit=rlim_t}
| bash_cv_getenv_redef=${bash_cv_getenv_redef=yes}
| bash_cv_ulimit_maxfds=${bash_cv_ulimit_maxfds=yes}
| bash_cv_getcwd_calls_popen=${bash_cv_getcwd_calls_popen=no}
| bash_cv_printf_a_format=${bash_cv_printf_a_format=yes}
| bash_cv_pgrp_pipe=${bash_cv_pgrp_pipe=no}
| bash_cv_job_control_missing=${bash_cv_job_control_missing=present}
| bash_cv_sys_named_pipes=${bash_cv_sys_named_pipes=present}
| bash_cv_unusable_rtsigs=${bash_cv_unusable_rtsigs=no}
| ac_cv_have_decl_sys_siglist=${ac_cv_have_decl_sys_siglist=yes}
| 
| # mono
| cv_mono_sizeof_sunpath=108
| 
| # mysql
| mysql_cv_func_atomic_sub=${mysql_cv_func_atomic_sub=no}
| mysql_cv_func_atomic_add=${mysql_cv_func_atomic_add=no}
| ac_cv_conv_longlong_to_float=${ac_cv_conv_longlong_to_float=yes}
| 
| # gettext
| am_cv_func_working_getline=${am_cv_func_working_getline=yes}
| 
| # fnmatch
| ac_cv_func_fnmatch_works=${ac_cv_func_fnmatch_works=yes}
| 
| # rsync
| rsync_cv_HAVE_BROKEN_LARGEFILE=${rsync_cv_HAVE_BROKEN_LARGEFILE=no}
| rsync_cv_HAVE_SOCKETPAIR=${rsync_cv_HAVE_SOCKETPAIR=yes}
| rsync_cv_HAVE_LONGLONG=${rsync_cv_HAVE_LONGLONG=yes}
| rsync_cv_HAVE_OFF64_T=${rsync_cv_HAVE_OFF64_T=no}
| rsync_cv_HAVE_SHORT_INO_T=${rsync_cv_HAVE_SHORT_INO_T=no}
| rsync_cv_HAVE_UNSIGNED_CHAR=${rsync_cv_HAVE_UNSIGNED_CHAR=no}
| rsync_cv_HAVE_BROKEN_READDIR=${rsync_cv_HAVE_BROKEN_READDIR=no}
| rsync_cv_HAVE_GETTIMEOFDAY_TZ=${rsync_cv_HAVE_GETTIMEOFDAY_TZ=yes}
| rsync_cv_HAVE_C99_VSNPRINTF=${rsync_cv_HAVE_C99_VSNPRINTF=yes}
| rsync_cv_HAVE_SECURE_MKSTEMP=${rsync_cv_HAVE_SECURE_MKSTEMP=yes}
| rsync_cv_REPLACE_INET_NTOA=${rsync_cv_REPLACE_INET_NTOA=no}
| rsync_cv_REPLACE_INET_ATON=${rsync_cv_REPLACE_INET_ATON=no}
| 
| # sudo
| sudo_cv_uid_t_len=${sudo_cv_uid_t_len=10}
| 
| # ipsec-tools
| ac_cv_va_copy=${ac_cv_va_copy=no}
| ac_cv_va_val_copy=${ac_cv_va_val_copy=yes}
| ac_cv___va_copy=${ac_cv___va_copy=yes}
| racoon_cv_bug_getaddrinfo=${racoon_cv_bug_getaddrinfo=no}
| 
| # screen
| screen_cv_sys_bcopy_overlap=${screen_cv_sys_bcopy_overlap=no}
| screen_cv_sys_memcpy_overlap=${screen_cv_sys_memcpy_overlap=no}
| screen_cv_sys_memmove_overlap=${screen_cv_sys_memmove_overlap=no}
| screen_cv_sys_fifo_broken_impl=${screen_cv_sys_fifo_broken_impl=yes}
| screen_cv_sys_fifo_usable=${screen_cv_sys_fifo_usable=yes}
| screen_cv_sys_select_broken_retval=${screen_cv_sys_select_broken_retval=no}
| screen_cv_sys_sockets_nofs=${screen_cv_sys_sockets_nofs=no}
| screen_cv_sys_sockets_usable=${screen_cv_sys_sockets_usable=yes}
| screen_cv_sys_terminfo_used=${screen_cv_sys_terminfo_used=yes}
| 
| ac_cv_func_lstat_dereferences_slashed_symlink=${ac_cv_func_lstat_dereferences_slashed_symlink=yes}
| ac_cv_func_lstat_empty_string_bug=${ac_cv_func_lstat_empty_string_bug=no}
| ac_cv_func_stat_empty_string_bug=${ac_cv_func_stat_empty_string_bug=no}
| ac_cv_func_stat_ignores_trailing_slash=${ac_cv_func_stat_ignores_trailing_slash=no}
| 
| # php
| ac_cv_pread=${ac_cv_pread=no}
| ac_cv_pwrite=${ac_cv_pwrite=no}
| php_cv_lib_cookie_io_functions_use_off64_t=${php_cv_lib_cookie_io_functions_use_off64_t=yes}
| 
| # ssh
| ac_cv_have_space_d_name_in_struct_dirent=${ac_cv_dirent_have_space_d_name=yes}
| ac_cv_have_broken_snprintf=${ac_cv_have_broken_snprintf=no}
| ac_cv_have_accrights_in_msghdr=${ac_cv_have_accrights_in_msghdr=no}
| ac_cv_have_control_in_msghdr=${ac_cv_have_control_in_msghdr=yes}
| ac_cv_have_openpty_ctty_bug=${ac_cv_have_openpty_ctty_bug=yes}
| 
| # libxfce4util
| with_broken_putenv=${with_broken_putenv=no}
| 
| # xffm
| jm_cv_func_working_readdir=yes
configure:1228: creating cache ./config.cache
configure:1348: checking build system type
configure:1366: result: i686-pc-linux-gnu
configure:1374: checking host system type
configure:1388: result: i686-pc-linux-gnu
configure:1396: checking target system type
configure:1410: result: arm-unknown-linux-gnu
configure:1432: checking for i686-linux-gcc
configure:1458: result: ccache gcc
configure:1740: checking for C compiler version
configure:1743: ccache gcc --version </dev/null >&5
gcc (GCC) 3.3.6 (Debian 1:3.3.6-9)
Copyright (C) 2003 Free Software Foundation, Inc.
This is free software; see the source for copying conditions.  There is NO
warranty; not even for MERCHANTABILITY or FITNESS FOR A PARTICULAR PURPOSE.

configure:1746: $? = 0
configure:1748: ccache gcc -v </dev/null >&5
Reading specs from /usr/lib/gcc-lib/i486-linux-gnu/3.3.6/specs
Configured with: ../src/configure -v --enable-languages=c,c++,ada --prefix=/usr --mandir=/usr/share/man --infodir=/usr/share/info --with-gxx-include-dir=/usr/include/c++/3.3 --enable-shared --enable-__cxa_atexit --with-system-zlib --enable-nls --without-included-gettext --enable-clocale=gnu --enable-debug i486-linux-gnu
Thread model: posix
gcc version 3.3.6 (Debian 1:3.3.6-9)
configure:1751: $? = 0
configure:1753: ccache gcc -V </dev/null >&5
gcc: `-V' option must have argument
configure:1756: $? = 1
configure:1779: checking for C compiler default output file name
configure:1782: ccache gcc -I/home/raphael/devel/zaurus/bitbake/tmp/staging/i686-linux/include -O2 -I/home/raphael/devel/zaurus/bitbake/tmp/staging/i686-linux/include -L/home/raphael/devel/zaurus/bitbake/tmp/staging/i686-linux/lib -Wl,-rpath-link,/home/raphael/devel/zaurus/bitbake/tmp/staging/i686-linux/lib -Wl,-rpath,/home/raphael/devel/zaurus/bitbake/tmp/staging/i686-linux/lib -Wl,-O1 conftest.c  >&5
configure:1785: $? = 0
configure:1831: result: a.out
configure:1836: checking whether the C compiler works
configure:1842: ./a.out
configure:1845: $? = 0
configure:1862: result: yes
configure:1869: checking whether we are cross compiling
configure:1871: result: no
configure:1874: checking for suffix of executables
configure:1876: ccache gcc -o conftest -I/home/raphael/devel/zaurus/bitbake/tmp/staging/i686-linux/include -O2 -I/home/raphael/devel/zaurus/bitbake/tmp/staging/i686-linux/include -L/home/raphael/devel/zaurus/bitbake/tmp/staging/i686-linux/lib -Wl,-rpath-link,/home/raphael/devel/zaurus/bitbake/tmp/staging/i686-linux/lib -Wl,-rpath,/home/raphael/devel/zaurus/bitbake/tmp/staging/i686-linux/lib -Wl,-O1 conftest.c  >&5
configure:1879: $? = 0
configure:1904: result: 
configure:1910: checking for suffix of object files
configure:1931: ccache gcc -c -I/home/raphael/devel/zaurus/bitbake/tmp/staging/i686-linux/include -O2 -I/home/raphael/devel/zaurus/bitbake/tmp/staging/i686-linux/include conftest.c >&5
configure:1934: $? = 0
configure:1956: result: o
configure:1960: checking whether we are using the GNU C compiler
configure:1984: ccache gcc -c -I/home/raphael/devel/zaurus/bitbake/tmp/staging/i686-linux/include -O2 -I/home/raphael/devel/zaurus/bitbake/tmp/staging/i686-linux/include conftest.c >&5
configure:1990: $? = 0
configure:1994: test -z 
			 || test ! -s conftest.err
configure:1997: $? = 0
configure:2000: test -s conftest.o
configure:2003: $? = 0
configure:2016: result: yes
configure:2022: checking whether ccache gcc accepts -g
configure:2043: ccache gcc -c -g -I/home/raphael/devel/zaurus/bitbake/tmp/staging/i686-linux/include conftest.c >&5
configure:2049: $? = 0
configure:2053: test -z 
			 || test ! -s conftest.err
configure:2056: $? = 0
configure:2059: test -s conftest.o
configure:2062: $? = 0
configure:2073: result: yes
configure:2090: checking for ccache gcc option to accept ANSI C
configure:2160: ccache gcc  -c -I/home/raphael/devel/zaurus/bitbake/tmp/staging/i686-linux/include -O2 -I/home/raphael/devel/zaurus/bitbake/tmp/staging/i686-linux/include conftest.c >&5
configure:2166: $? = 0
configure:2170: test -z 
			 || test ! -s conftest.err
configure:2173: $? = 0
configure:2176: test -s conftest.o
configure:2179: $? = 0
configure:2197: result: none needed
configure:2215: ccache gcc -c -I/home/raphael/devel/zaurus/bitbake/tmp/staging/i686-linux/include -O2 -I/home/raphael/devel/zaurus/bitbake/tmp/staging/i686-linux/include conftest.c >&5
conftest.c:2: error: syntax error before "me"
configure:2221: $? = 1
configure: failed program was:
| #ifndef __cplusplus
|   choke me
| #endif
configure:2473: checking how to run the C preprocessor
configure:2591: result: gcc -E
configure:2615: gcc -E -I/home/raphael/devel/zaurus/bitbake/tmp/staging/i686-linux/include conftest.c
configure:2621: $? = 0
configure:2653: gcc -E -I/home/raphael/devel/zaurus/bitbake/tmp/staging/i686-linux/include conftest.c
conftest.c:10:28: ac_nonexistent.h: No such file or directory
configure:2659: $? = 1
configure: failed program was:
| /* confdefs.h.  */
| 
| #define PACKAGE_NAME "fixincludes"
| #define PACKAGE_TARNAME "fixincludes"
| #define PACKAGE_VERSION " "
| #define PACKAGE_STRING "fixincludes  "
| #define PACKAGE_BUGREPORT ""
| #define EXE_EXT ""
| /* end confdefs.h.  */
| #include <ac_nonexistent.h>
configure:2703: checking for egrep
configure:2713: result: grep -E
configure:2718: checking for ANSI C header files
configure:2743: ccache gcc -c -I/home/raphael/devel/zaurus/bitbake/tmp/staging/i686-linux/include -O2 -I/home/raphael/devel/zaurus/bitbake/tmp/staging/i686-linux/include conftest.c >&5
configure:2749: $? = 0
configure:2753: test -z 
			 || test ! -s conftest.err
configure:2756: $? = 0
configure:2759: test -s conftest.o
configure:2762: $? = 0
configure:2851: ccache gcc -o conftest -I/home/raphael/devel/zaurus/bitbake/tmp/staging/i686-linux/include -O2 -I/home/raphael/devel/zaurus/bitbake/tmp/staging/i686-linux/include -L/home/raphael/devel/zaurus/bitbake/tmp/staging/i686-linux/lib -Wl,-rpath-link,/home/raphael/devel/zaurus/bitbake/tmp/staging/i686-linux/lib -Wl,-rpath,/home/raphael/devel/zaurus/bitbake/tmp/staging/i686-linux/lib -Wl,-O1 conftest.c  >&5
configure:2854: $? = 0
configure:2856: ./conftest
configure:2859: $? = 0
configure:2874: result: yes
configure:2898: checking for sys/types.h
configure:2914: ccache gcc -c -I/home/raphael/devel/zaurus/bitbake/tmp/staging/i686-linux/include -O2 -I/home/raphael/devel/zaurus/bitbake/tmp/staging/i686-linux/include conftest.c >&5
configure:2920: $? = 0
configure:2924: test -z 
			 || test ! -s conftest.err
configure:2927: $? = 0
configure:2930: test -s conftest.o
configure:2933: $? = 0
configure:2944: result: yes
configure:2898: checking for sys/stat.h
configure:2914: ccache gcc -c -I/home/raphael/devel/zaurus/bitbake/tmp/staging/i686-linux/include -O2 -I/home/raphael/devel/zaurus/bitbake/tmp/staging/i686-linux/include conftest.c >&5
configure:2920: $? = 0
configure:2924: test -z 
			 || test ! -s conftest.err
configure:2927: $? = 0
configure:2930: test -s conftest.o
configure:2933: $? = 0
configure:2944: result: yes
configure:2898: checking for stdlib.h
configure:2914: ccache gcc -c -I/home/raphael/devel/zaurus/bitbake/tmp/staging/i686-linux/include -O2 -I/home/raphael/devel/zaurus/bitbake/tmp/staging/i686-linux/include conftest.c >&5
configure:2920: $? = 0
configure:2924: test -z 
			 || test ! -s conftest.err
configure:2927: $? = 0
configure:2930: test -s conftest.o
configure:2933: $? = 0
configure:2944: result: yes
configure:2898: checking for string.h
configure:2914: ccache gcc -c -I/home/raphael/devel/zaurus/bitbake/tmp/staging/i686-linux/include -O2 -I/home/raphael/devel/zaurus/bitbake/tmp/staging/i686-linux/include conftest.c >&5
configure:2920: $? = 0
configure:2924: test -z 
			 || test ! -s conftest.err
configure:2927: $? = 0
configure:2930: test -s conftest.o
configure:2933: $? = 0
configure:2944: result: yes
configure:2898: checking for memory.h
configure:2914: ccache gcc -c -I/home/raphael/devel/zaurus/bitbake/tmp/staging/i686-linux/include -O2 -I/home/raphael/devel/zaurus/bitbake/tmp/staging/i686-linux/include conftest.c >&5
configure:2920: $? = 0
configure:2924: test -z 
			 || test ! -s conftest.err
configure:2927: $? = 0
configure:2930: test -s conftest.o
configure:2933: $? = 0
configure:2944: result: yes
configure:2898: checking for strings.h
configure:2914: ccache gcc -c -I/home/raphael/devel/zaurus/bitbake/tmp/staging/i686-linux/include -O2 -I/home/raphael/devel/zaurus/bitbake/tmp/staging/i686-linux/include conftest.c >&5
configure:2920: $? = 0
configure:2924: test -z 
			 || test ! -s conftest.err
configure:2927: $? = 0
configure:2930: test -s conftest.o
configure:2933: $? = 0
configure:2944: result: yes
configure:2898: checking for inttypes.h
configure:2914: ccache gcc -c -I/home/raphael/devel/zaurus/bitbake/tmp/staging/i686-linux/include -O2 -I/home/raphael/devel/zaurus/bitbake/tmp/staging/i686-linux/include conftest.c >&5
configure:2920: $? = 0
configure:2924: test -z 
			 || test ! -s conftest.err
configure:2927: $? = 0
configure:2930: test -s conftest.o
configure:2933: $? = 0
configure:2944: result: yes
configure:2898: checking for stdint.h
configure:2914: ccache gcc -c -I/home/raphael/devel/zaurus/bitbake/tmp/staging/i686-linux/include -O2 -I/home/raphael/devel/zaurus/bitbake/tmp/staging/i686-linux/include conftest.c >&5
configure:2920: $? = 0
configure:2924: test -z 
			 || test ! -s conftest.err
configure:2927: $? = 0
configure:2930: test -s conftest.o
configure:2933: $? = 0
configure:2944: result: yes
configure:2898: checking for unistd.h
configure:2914: ccache gcc -c -I/home/raphael/devel/zaurus/bitbake/tmp/staging/i686-linux/include -O2 -I/home/raphael/devel/zaurus/bitbake/tmp/staging/i686-linux/include conftest.c >&5
configure:2920: $? = 0
configure:2924: test -z 
			 || test ! -s conftest.err
configure:2927: $? = 0
configure:2930: test -s conftest.o
configure:2933: $? = 0
configure:2944: result: yes
configure:2977: checking stddef.h usability
configure:2989: ccache gcc -c -I/home/raphael/devel/zaurus/bitbake/tmp/staging/i686-linux/include -O2 -I/home/raphael/devel/zaurus/bitbake/tmp/staging/i686-linux/include conftest.c >&5
configure:2995: $? = 0
configure:2999: test -z 
			 || test ! -s conftest.err
configure:3002: $? = 0
configure:3005: test -s conftest.o
configure:3008: $? = 0
configure:3018: result: yes
configure:3022: checking stddef.h presence
configure:3032: gcc -E -I/home/raphael/devel/zaurus/bitbake/tmp/staging/i686-linux/include conftest.c
configure:3038: $? = 0
configure:3058: result: yes
configure:3093: checking for stddef.h
configure:3100: result: yes
configure:2968: checking for stdlib.h
configure:2973: result: yes
configure:2968: checking for strings.h
configure:2973: result: yes
configure:2968: checking for unistd.h
configure:2973: result: yes
configure:2977: checking fcntl.h usability
configure:2989: ccache gcc -c -I/home/raphael/devel/zaurus/bitbake/tmp/staging/i686-linux/include -O2 -I/home/raphael/devel/zaurus/bitbake/tmp/staging/i686-linux/include conftest.c >&5
configure:2995: $? = 0
configure:2999: test -z 
			 || test ! -s conftest.err
configure:3002: $? = 0
configure:3005: test -s conftest.o
configure:3008: $? = 0
configure:3018: result: yes
configure:3022: checking fcntl.h presence
configure:3032: gcc -E -I/home/raphael/devel/zaurus/bitbake/tmp/staging/i686-linux/include conftest.c
configure:3038: $? = 0
configure:3058: result: yes
configure:3093: checking for fcntl.h
configure:3100: result: yes
configure:2977: checking sys/file.h usability
configure:2989: ccache gcc -c -I/home/raphael/devel/zaurus/bitbake/tmp/staging/i686-linux/include -O2 -I/home/raphael/devel/zaurus/bitbake/tmp/staging/i686-linux/include conftest.c >&5
configure:2995: $? = 0
configure:2999: test -z 
			 || test ! -s conftest.err
configure:3002: $? = 0
configure:3005: test -s conftest.o
configure:3008: $? = 0
configure:3018: result: yes
configure:3022: checking sys/file.h presence
configure:3032: gcc -E -I/home/raphael/devel/zaurus/bitbake/tmp/staging/i686-linux/include conftest.c
configure:3038: $? = 0
configure:3058: result: yes
configure:3093: checking for sys/file.h
configure:3100: result: yes
configure:2968: checking for sys/stat.h
configure:2973: result: yes
configure:3122: checking for putc_unlocked
configure:3179: ccache gcc -o conftest -I/home/raphael/devel/zaurus/bitbake/tmp/staging/i686-linux/include -O2 -I/home/raphael/devel/zaurus/bitbake/tmp/staging/i686-linux/include -L/home/raphael/devel/zaurus/bitbake/tmp/staging/i686-linux/lib -Wl,-rpath-link,/home/raphael/devel/zaurus/bitbake/tmp/staging/i686-linux/lib -Wl,-rpath,/home/raphael/devel/zaurus/bitbake/tmp/staging/i686-linux/lib -Wl,-O1 conftest.c  >&5
configure:3185: $? = 0
configure:3189: test -z 
			 || test ! -s conftest.err
configure:3192: $? = 0
configure:3195: test -s conftest
configure:3198: $? = 0
configure:3210: result: yes
configure:3122: checking for fputc_unlocked
configure:3179: ccache gcc -o conftest -I/home/raphael/devel/zaurus/bitbake/tmp/staging/i686-linux/include -O2 -I/home/raphael/devel/zaurus/bitbake/tmp/staging/i686-linux/include -L/home/raphael/devel/zaurus/bitbake/tmp/staging/i686-linux/lib -Wl,-rpath-link,/home/raphael/devel/zaurus/bitbake/tmp/staging/i686-linux/lib -Wl,-rpath,/home/raphael/devel/zaurus/bitbake/tmp/staging/i686-linux/lib -Wl,-O1 conftest.c  >&5
configure:3185: $? = 0
configure:3189: test -z 
			 || test ! -s conftest.err
configure:3192: $? = 0
configure:3195: test -s conftest
configure:3198: $? = 0
configure:3210: result: yes
configure:3122: checking for fputs_unlocked
configure:3179: ccache gcc -o conftest -I/home/raphael/devel/zaurus/bitbake/tmp/staging/i686-linux/include -O2 -I/home/raphael/devel/zaurus/bitbake/tmp/staging/i686-linux/include -L/home/raphael/devel/zaurus/bitbake/tmp/staging/i686-linux/lib -Wl,-rpath-link,/home/raphael/devel/zaurus/bitbake/tmp/staging/i686-linux/lib -Wl,-rpath,/home/raphael/devel/zaurus/bitbake/tmp/staging/i686-linux/lib -Wl,-O1 conftest.c  >&5
conftest.c:53: warning: conflicting types for built-in function `fputs_unlocked'
configure:3185: $? = 0
configure:3189: test -z 
			 || test ! -s conftest.err
configure:3192: $? = 0
configure:3195: test -s conftest
configure:3198: $? = 0
configure:3210: result: yes
configure:3122: checking for fwrite_unlocked
configure:3179: ccache gcc -o conftest -I/home/raphael/devel/zaurus/bitbake/tmp/staging/i686-linux/include -O2 -I/home/raphael/devel/zaurus/bitbake/tmp/staging/i686-linux/include -L/home/raphael/devel/zaurus/bitbake/tmp/staging/i686-linux/lib -Wl,-rpath-link,/home/raphael/devel/zaurus/bitbake/tmp/staging/i686-linux/lib -Wl,-rpath,/home/raphael/devel/zaurus/bitbake/tmp/staging/i686-linux/lib -Wl,-O1 conftest.c  >&5
configure:3185: $? = 0
configure:3189: test -z 
			 || test ! -s conftest.err
configure:3192: $? = 0
configure:3195: test -s conftest
configure:3198: $? = 0
configure:3210: result: yes
configure:3122: checking for fprintf_unlocked
configure:3179: ccache gcc -o conftest -I/home/raphael/devel/zaurus/bitbake/tmp/staging/i686-linux/include -O2 -I/home/raphael/devel/zaurus/bitbake/tmp/staging/i686-linux/include -L/home/raphael/devel/zaurus/bitbake/tmp/staging/i686-linux/lib -Wl,-rpath-link,/home/raphael/devel/zaurus/bitbake/tmp/staging/i686-linux/lib -Wl,-rpath,/home/raphael/devel/zaurus/bitbake/tmp/staging/i686-linux/lib -Wl,-O1 conftest.c  >&5
conftest.c:55: warning: conflicting types for built-in function `fprintf_unlocked'
/tmp/ccgdShqP.o: In function `main':
conftest.c:(.text+0x11): undefined reference to `fprintf_unlocked'
/tmp/ccgdShqP.o:(.data+0x0): undefined reference to `fprintf_unlocked'
collect2: ld returned 1 exit status
configure:3185: $? = 1
configure: failed program was:
| /* confdefs.h.  */
| 
| #define PACKAGE_NAME "fixincludes"
| #define PACKAGE_TARNAME "fixincludes"
| #define PACKAGE_VERSION " "
| #define PACKAGE_STRING "fixincludes  "
| #define PACKAGE_BUGREPORT ""
| #define EXE_EXT ""
| #define STDC_HEADERS 1
| #define HAVE_SYS_TYPES_H 1
| #define HAVE_SYS_STAT_H 1
| #define HAVE_STDLIB_H 1
| #define HAVE_STRING_H 1
| #define HAVE_MEMORY_H 1
| #define HAVE_STRINGS_H 1
| #define HAVE_INTTYPES_H 1
| #define HAVE_STDINT_H 1
| #define HAVE_UNISTD_H 1
| #define HAVE_STDDEF_H 1
| #define HAVE_STDLIB_H 1
| #define HAVE_STRINGS_H 1
| #define HAVE_UNISTD_H 1
| #define HAVE_FCNTL_H 1
| #define HAVE_SYS_FILE_H 1
| #define HAVE_SYS_STAT_H 1
| #define HAVE_PUTC_UNLOCKED 1
| #define HAVE_FPUTC_UNLOCKED 1
| #define HAVE_FPUTS_UNLOCKED 1
| #define HAVE_FWRITE_UNLOCKED 1
| /* end confdefs.h.  */
| /* Define fprintf_unlocked to an innocuous variant, in case <limits.h> declares fprintf_unlocked.
|    For example, HP-UX 11i <limits.h> declares gettimeofday.  */
| #define fprintf_unlocked innocuous_fprintf_unlocked
| 
| /* System header to define __stub macros and hopefully few prototypes,
|     which can conflict with char fprintf_unlocked (); below.
|     Prefer <limits.h> to <assert.h> if __STDC__ is defined, since
|     <limits.h> exists even on freestanding compilers.  */
| 
| #ifdef __STDC__
| # include <limits.h>
| #else
| # include <assert.h>
| #endif
| 
| #undef fprintf_unlocked
| 
| /* Override any gcc2 internal prototype to avoid an error.  */
| #ifdef __cplusplus
| extern "C"
| {
| #endif
| /* We use char because int might match the return type of a gcc2
|    builtin and then its argument prototype would still apply.  */
| char fprintf_unlocked ();
| /* The GNU C library defines this for functions which it implements
|     to always fail with ENOSYS.  Some functions are actually named
|     something starting with __ and the normal name is an alias.  */
| #if defined (__stub_fprintf_unlocked) || defined (__stub___fprintf_unlocked)
| choke me
| #else
| char (*f) () = fprintf_unlocked;
| #endif
| #ifdef __cplusplus
| }
| #endif
| 
| int
| main ()
| {
| return f != fprintf_unlocked;
|   ;
|   return 0;
| }
configure:3210: result: no
configure:3220: checking whether abort is declared
configure:3244: ccache gcc -c -I/home/raphael/devel/zaurus/bitbake/tmp/staging/i686-linux/include -O2 -I/home/raphael/devel/zaurus/bitbake/tmp/staging/i686-linux/include conftest.c >&5
configure:3250: $? = 0
configure:3254: test -z 
			 || test ! -s conftest.err
configure:3257: $? = 0
configure:3260: test -s conftest.o
configure:3263: $? = 0
configure:3274: result: yes
configure:3290: checking whether errno is declared
configure:3314: ccache gcc -c -I/home/raphael/devel/zaurus/bitbake/tmp/staging/i686-linux/include -O2 -I/home/raphael/devel/zaurus/bitbake/tmp/staging/i686-linux/include conftest.c >&5
conftest.c: In function `main':
conftest.c:70: error: `errno' undeclared (first use in this function)
conftest.c:70: error: (Each undeclared identifier is reported only once
conftest.c:70: error: for each function it appears in.)
configure:3320: $? = 1
configure: failed program was:
| /* confdefs.h.  */
| 
| #define PACKAGE_NAME "fixincludes"
| #define PACKAGE_TARNAME "fixincludes"
| #define PACKAGE_VERSION " "
| #define PACKAGE_STRING "fixincludes  "
| #define PACKAGE_BUGREPORT ""
| #define EXE_EXT ""
| #define STDC_HEADERS 1
| #define HAVE_SYS_TYPES_H 1
| #define HAVE_SYS_STAT_H 1
| #define HAVE_STDLIB_H 1
| #define HAVE_STRING_H 1
| #define HAVE_MEMORY_H 1
| #define HAVE_STRINGS_H 1
| #define HAVE_INTTYPES_H 1
| #define HAVE_STDINT_H 1
| #define HAVE_UNISTD_H 1
| #define HAVE_STDDEF_H 1
| #define HAVE_STDLIB_H 1
| #define HAVE_STRINGS_H 1
| #define HAVE_UNISTD_H 1
| #define HAVE_FCNTL_H 1
| #define HAVE_SYS_FILE_H 1
| #define HAVE_SYS_STAT_H 1
| #define HAVE_PUTC_UNLOCKED 1
| #define HAVE_FPUTC_UNLOCKED 1
| #define HAVE_FPUTS_UNLOCKED 1
| #define HAVE_FWRITE_UNLOCKED 1
| #define HAVE_DECL_ABORT 1
| /* end confdefs.h.  */
| #include <stdio.h>
| #if HAVE_SYS_TYPES_H
| # include <sys/types.h>
| #endif
| #if HAVE_SYS_STAT_H
| # include <sys/stat.h>
| #endif
| #if STDC_HEADERS
| # include <stdlib.h>
| # include <stddef.h>
| #else
| # if HAVE_STDLIB_H
| #  include <stdlib.h>
| # endif
| #endif
| #if HAVE_STRING_H
| # if !STDC_HEADERS && HAVE_MEMORY_H
| #  include <memory.h>
| # endif
| # include <string.h>
| #endif
| #if HAVE_STRINGS_H
| # include <strings.h>
| #endif
| #if HAVE_INTTYPES_H
| # include <inttypes.h>
| #else
| # if HAVE_STDINT_H
| #  include <stdint.h>
| # endif
| #endif
| #if HAVE_UNISTD_H
| # include <unistd.h>
| #endif
| int
| main ()
| {
| #ifndef errno
|   char *p = (char *) errno;
| #endif
| 
|   ;
|   return 0;
| }
configure:3344: result: no
configure:3360: checking whether putc_unlocked is declared
configure:3384: ccache gcc -c -I/home/raphael/devel/zaurus/bitbake/tmp/staging/i686-linux/include -O2 -I/home/raphael/devel/zaurus/bitbake/tmp/staging/i686-linux/include conftest.c >&5
configure:3390: $? = 0
configure:3394: test -z 
			 || test ! -s conftest.err
configure:3397: $? = 0
configure:3400: test -s conftest.o
configure:3403: $? = 0
configure:3414: result: yes
configure:3430: checking whether fputc_unlocked is declared
configure:3454: ccache gcc -c -I/home/raphael/devel/zaurus/bitbake/tmp/staging/i686-linux/include -O2 -I/home/raphael/devel/zaurus/bitbake/tmp/staging/i686-linux/include conftest.c >&5
configure:3460: $? = 0
configure:3464: test -z 
			 || test ! -s conftest.err
configure:3467: $? = 0
configure:3470: test -s conftest.o
configure:3473: $? = 0
configure:3484: result: yes
configure:3500: checking whether fputs_unlocked is declared
configure:3524: ccache gcc -c -I/home/raphael/devel/zaurus/bitbake/tmp/staging/i686-linux/include -O2 -I/home/raphael/devel/zaurus/bitbake/tmp/staging/i686-linux/include conftest.c >&5
conftest.c: In function `main':
conftest.c:73: error: `fputs_unlocked' undeclared (first use in this function)
conftest.c:73: error: (Each undeclared identifier is reported only once
conftest.c:73: error: for each function it appears in.)
configure:3530: $? = 1
configure: failed program was:
| /* confdefs.h.  */
| 
| #define PACKAGE_NAME "fixincludes"
| #define PACKAGE_TARNAME "fixincludes"
| #define PACKAGE_VERSION " "
| #define PACKAGE_STRING "fixincludes  "
| #define PACKAGE_BUGREPORT ""
| #define EXE_EXT ""
| #define STDC_HEADERS 1
| #define HAVE_SYS_TYPES_H 1
| #define HAVE_SYS_STAT_H 1
| #define HAVE_STDLIB_H 1
| #define HAVE_STRING_H 1
| #define HAVE_MEMORY_H 1
| #define HAVE_STRINGS_H 1
| #define HAVE_INTTYPES_H 1
| #define HAVE_STDINT_H 1
| #define HAVE_UNISTD_H 1
| #define HAVE_STDDEF_H 1
| #define HAVE_STDLIB_H 1
| #define HAVE_STRINGS_H 1
| #define HAVE_UNISTD_H 1
| #define HAVE_FCNTL_H 1
| #define HAVE_SYS_FILE_H 1
| #define HAVE_SYS_STAT_H 1
| #define HAVE_PUTC_UNLOCKED 1
| #define HAVE_FPUTC_UNLOCKED 1
| #define HAVE_FPUTS_UNLOCKED 1
| #define HAVE_FWRITE_UNLOCKED 1
| #define HAVE_DECL_ABORT 1
| #define HAVE_DECL_ERRNO 0
| #define HAVE_DECL_PUTC_UNLOCKED 1
| #define HAVE_DECL_FPUTC_UNLOCKED 1
| /* end confdefs.h.  */
| #include <stdio.h>
| #if HAVE_SYS_TYPES_H
| # include <sys/types.h>
| #endif
| #if HAVE_SYS_STAT_H
| # include <sys/stat.h>
| #endif
| #if STDC_HEADERS
| # include <stdlib.h>
| # include <stddef.h>
| #else
| # if HAVE_STDLIB_H
| #  include <stdlib.h>
| # endif
| #endif
| #if HAVE_STRING_H
| # if !STDC_HEADERS && HAVE_MEMORY_H
| #  include <memory.h>
| # endif
| # include <string.h>
| #endif
| #if HAVE_STRINGS_H
| # include <strings.h>
| #endif
| #if HAVE_INTTYPES_H
| # include <inttypes.h>
| #else
| # if HAVE_STDINT_H
| #  include <stdint.h>
| # endif
| #endif
| #if HAVE_UNISTD_H
| # include <unistd.h>
| #endif
| int
| main ()
| {
| #ifndef fputs_unlocked
|   char *p = (char *) fputs_unlocked;
| #endif
| 
|   ;
|   return 0;
| }
configure:3554: result: no
configure:3570: checking whether fwrite_unlocked is declared
configure:3594: ccache gcc -c -I/home/raphael/devel/zaurus/bitbake/tmp/staging/i686-linux/include -O2 -I/home/raphael/devel/zaurus/bitbake/tmp/staging/i686-linux/include conftest.c >&5
configure:3600: $? = 0
configure:3604: test -z 
			 || test ! -s conftest.err
configure:3607: $? = 0
configure:3610: test -s conftest.o
configure:3613: $? = 0
configure:3624: result: yes
configure:3640: checking whether fprintf_unlocked is declared
configure:3664: ccache gcc -c -I/home/raphael/devel/zaurus/bitbake/tmp/staging/i686-linux/include -O2 -I/home/raphael/devel/zaurus/bitbake/tmp/staging/i686-linux/include conftest.c >&5
conftest.c: In function `main':
conftest.c:75: error: `fprintf_unlocked' undeclared (first use in this function)
conftest.c:75: error: (Each undeclared identifier is reported only once
conftest.c:75: error: for each function it appears in.)
configure:3670: $? = 1
configure: failed program was:
| /* confdefs.h.  */
| 
| #define PACKAGE_NAME "fixincludes"
| #define PACKAGE_TARNAME "fixincludes"
| #define PACKAGE_VERSION " "
| #define PACKAGE_STRING "fixincludes  "
| #define PACKAGE_BUGREPORT ""
| #define EXE_EXT ""
| #define STDC_HEADERS 1
| #define HAVE_SYS_TYPES_H 1
| #define HAVE_SYS_STAT_H 1
| #define HAVE_STDLIB_H 1
| #define HAVE_STRING_H 1
| #define HAVE_MEMORY_H 1
| #define HAVE_STRINGS_H 1
| #define HAVE_INTTYPES_H 1
| #define HAVE_STDINT_H 1
| #define HAVE_UNISTD_H 1
| #define HAVE_STDDEF_H 1
| #define HAVE_STDLIB_H 1
| #define HAVE_STRINGS_H 1
| #define HAVE_UNISTD_H 1
| #define HAVE_FCNTL_H 1
| #define HAVE_SYS_FILE_H 1
| #define HAVE_SYS_STAT_H 1
| #define HAVE_PUTC_UNLOCKED 1
| #define HAVE_FPUTC_UNLOCKED 1
| #define HAVE_FPUTS_UNLOCKED 1
| #define HAVE_FWRITE_UNLOCKED 1
| #define HAVE_DECL_ABORT 1
| #define HAVE_DECL_ERRNO 0
| #define HAVE_DECL_PUTC_UNLOCKED 1
| #define HAVE_DECL_FPUTC_UNLOCKED 1
| #define HAVE_DECL_FPUTS_UNLOCKED 0
| #define HAVE_DECL_FWRITE_UNLOCKED 1
| /* end confdefs.h.  */
| #include <stdio.h>
| #if HAVE_SYS_TYPES_H
| # include <sys/types.h>
| #endif
| #if HAVE_SYS_STAT_H
| # include <sys/stat.h>
| #endif
| #if STDC_HEADERS
| # include <stdlib.h>
| # include <stddef.h>
| #else
| # if HAVE_STDLIB_H
| #  include <stdlib.h>
| # endif
| #endif
| #if HAVE_STRING_H
| # if !STDC_HEADERS && HAVE_MEMORY_H
| #  include <memory.h>
| # endif
| # include <string.h>
| #endif
| #if HAVE_STRINGS_H
| # include <strings.h>
| #endif
| #if HAVE_INTTYPES_H
| # include <inttypes.h>
| #else
| # if HAVE_STDINT_H
| #  include <stdint.h>
| # endif
| #endif
| #if HAVE_UNISTD_H
| # include <unistd.h>
| #endif
| int
| main ()
| {
| #ifndef fprintf_unlocked
|   char *p = (char *) fprintf_unlocked;
| #endif
| 
|   ;
|   return 0;
| }
configure:3694: result: no
configure:3714: checking for an ANSI C-conforming const
configure:3781: ccache gcc -c -I/home/raphael/devel/zaurus/bitbake/tmp/staging/i686-linux/include -O2 -I/home/raphael/devel/zaurus/bitbake/tmp/staging/i686-linux/include conftest.c >&5
configure:3787: $? = 0
configure:3791: test -z 
			 || test ! -s conftest.err
configure:3794: $? = 0
configure:3797: test -s conftest.o
configure:3800: $? = 0
configure:3811: result: yes
configure:3834: checking sys/mman.h usability
configure:3846: ccache gcc -c -I/home/raphael/devel/zaurus/bitbake/tmp/staging/i686-linux/include -O2 -I/home/raphael/devel/zaurus/bitbake/tmp/staging/i686-linux/include conftest.c >&5
configure:3852: $? = 0
configure:3856: test -z 
			 || test ! -s conftest.err
configure:3859: $? = 0
configure:3862: test -s conftest.o
configure:3865: $? = 0
configure:3875: result: yes
configure:3879: checking sys/mman.h presence
configure:3889: gcc -E -I/home/raphael/devel/zaurus/bitbake/tmp/staging/i686-linux/include conftest.c
configure:3895: $? = 0
configure:3915: result: yes
configure:3950: checking for sys/mman.h
configure:3957: result: yes
configure:3968: checking for mmap
configure:4025: ccache gcc -o conftest -I/home/raphael/devel/zaurus/bitbake/tmp/staging/i686-linux/include -O2 -I/home/raphael/devel/zaurus/bitbake/tmp/staging/i686-linux/include -L/home/raphael/devel/zaurus/bitbake/tmp/staging/i686-linux/lib -Wl,-rpath-link,/home/raphael/devel/zaurus/bitbake/tmp/staging/i686-linux/lib -Wl,-rpath,/home/raphael/devel/zaurus/bitbake/tmp/staging/i686-linux/lib -Wl,-O1 conftest.c  >&5
configure:4031: $? = 0
configure:4035: test -z 
			 || test ! -s conftest.err
configure:4038: $? = 0
configure:4041: test -s conftest
configure:4044: $? = 0
configure:4056: result: yes
configure:4070: checking whether read-only mmap of a plain file works
configure:4087: result: yes
configure:4089: checking whether mmap from /dev/zero works
configure:4111: result: yes
configure:4115: checking for MAP_ANON(YMOUS)
configure:4143: ccache gcc -c -I/home/raphael/devel/zaurus/bitbake/tmp/staging/i686-linux/include -O2 -I/home/raphael/devel/zaurus/bitbake/tmp/staging/i686-linux/include conftest.c >&5
configure:4149: $? = 0
configure:4153: test -z 
			 || test ! -s conftest.err
configure:4156: $? = 0
configure:4159: test -s conftest.o
configure:4162: $? = 0
configure:4173: result: yes
configure:4179: checking whether mmap with MAP_ANON(YMOUS) works
configure:4196: result: yes
configure:4224: checking whether to enable maintainer-specific portions of Makefiles
configure:4233: result: no
configure:4341: creating ./config.status

## ---------------------- ##
## Running config.status. ##
## ---------------------- ##

This file was extended by fixincludes config.status  , which was
generated by GNU Autoconf 2.59.  Invocation command line was

  CONFIG_FILES    = 
  CONFIG_HEADERS  = 
  CONFIG_LINKS    = 
  CONFIG_COMMANDS = 
  $ ./config.status 

on TOKK

config.status:660: creating Makefile
config.status:660: creating mkheaders
config.status:756: creating config.h

## ---------------- ##
## Cache variables. ##
## ---------------- ##

ac_cv___va_copy=yes
ac_cv_alignof_CORBA_boolean=1
ac_cv_alignof_CORBA_char=1
ac_cv_alignof_CORBA_double=4
ac_cv_alignof_CORBA_float=4
ac_cv_alignof_CORBA_long=4
ac_cv_alignof_CORBA_long_double=4
ac_cv_alignof_CORBA_long_long=4
ac_cv_alignof_CORBA_octet=1
ac_cv_alignof_CORBA_pointer=4
ac_cv_alignof_CORBA_short=2
ac_cv_alignof_CORBA_struct=4
ac_cv_alignof_CORBA_wchar=2
ac_cv_build=i686-pc-linux-gnu
ac_cv_build_alias=i686-linux
ac_cv_c_bigendian=no
ac_cv_c_compiler_gnu=yes
ac_cv_c_const=yes
ac_cv_c_long_double=yes
ac_cv_conv_longlong_to_float=yes
ac_cv_dirent_have_space_d_name=yes
ac_cv_env_CC_set=set
ac_cv_env_CC_value='ccache gcc'
ac_cv_env_CFLAGS_set=set
ac_cv_env_CFLAGS_value='-I/home/raphael/devel/zaurus/bitbake/tmp/staging/i686-linux/include -O2'
ac_cv_env_CPPFLAGS_set=set
ac_cv_env_CPPFLAGS_value=-I/home/raphael/devel/zaurus/bitbake/tmp/staging/i686-linux/include
ac_cv_env_CPP_set=set
ac_cv_env_CPP_value='gcc -E'
ac_cv_env_LDFLAGS_set=set
ac_cv_env_LDFLAGS_value='-L/home/raphael/devel/zaurus/bitbake/tmp/staging/i686-linux/lib -Wl,-rpath-link,/home/raphael/devel/zaurus/bitbake/tmp/staging/i686-linux/lib -Wl,-rpath,/home/raphael/devel/zaurus/bitbake/tmp/staging/i686-linux/lib -Wl,-O1'
ac_cv_env_build_alias_set=set
ac_cv_env_build_alias_value=i686-linux
ac_cv_env_host_alias_set=set
ac_cv_env_host_alias_value=i686-linux
ac_cv_env_target_alias_set=set
ac_cv_env_target_alias_value=arm-linux
ac_cv_exeext=
ac_cv_func_fnmatch_works=yes
ac_cv_func_fprintf_unlocked=no
ac_cv_func_fputc_unlocked=yes
ac_cv_func_fputs_unlocked=yes
ac_cv_func_fwrite_unlocked=yes
ac_cv_func_getaddrinfo=yes
ac_cv_func_getpgrp_void=yes
ac_cv_func_getpwuid_r=yes
ac_cv_func_lstat_dereferences_slashed_symlink=yes
ac_cv_func_lstat_empty_string_bug=no
ac_cv_func_malloc_0_nonnull=yes
ac_cv_func_mmap=yes
ac_cv_func_posix_getpwnam_r=yes
ac_cv_func_posix_getpwuid_r=yes
ac_cv_func_pthread_key_delete=yes
ac_cv_func_putc_unlocked=yes
ac_cv_func_setpgrp_void=yes
ac_cv_func_setvbuf_reversed=no
ac_cv_func_stat_empty_string_bug=no
ac_cv_func_stat_ignores_trailing_slash=no
ac_cv_have_accrights_in_msghdr=no
ac_cv_have_broken_snprintf=no
ac_cv_have_control_in_msghdr=yes
ac_cv_have_decl_abort=yes
ac_cv_have_decl_errno=no
ac_cv_have_decl_fprintf_unlocked=no
ac_cv_have_decl_fputc_unlocked=yes
ac_cv_have_decl_fputs_unlocked=no
ac_cv_have_decl_fwrite_unlocked=yes
ac_cv_have_decl_putc_unlocked=yes
ac_cv_have_decl_sys_siglist=yes
ac_cv_have_openpty_ctty_bug=yes
ac_cv_have_space_d_name_in_struct_dirent=yes
ac_cv_header_fcntl_h=yes
ac_cv_header_inttypes_h=yes
ac_cv_header_memory_h=yes
ac_cv_header_netinet_sctp_h=no
ac_cv_header_netinet_sctp_uio_h=no
ac_cv_header_stdc=yes
ac_cv_header_stddef_h=yes
ac_cv_header_stdint_h=yes
ac_cv_header_stdlib_h=yes
ac_cv_header_string_h=yes
ac_cv_header_strings_h=yes
ac_cv_header_sys_file_h=yes
ac_cv_header_sys_mman_h=yes
ac_cv_header_sys_stat_h=yes
ac_cv_header_sys_types_h=yes
ac_cv_header_unistd_h=yes
ac_cv_host=i686-pc-linux-gnu
ac_cv_host_alias=i686-linux
ac_cv_linux_vers=2
ac_cv_objext=o
ac_cv_pread=no
ac_cv_prog_CC='ccache gcc'
ac_cv_prog_CPP='gcc -E'
ac_cv_prog_cc_g=yes
ac_cv_prog_cc_stdc=
ac_cv_prog_egrep='grep -E'
ac_cv_pwrite=no
ac_cv_sctp=no
ac_cv_sizeof_char=1
ac_cv_sizeof_char_p=4
ac_cv_sizeof_float=4
ac_cv_sizeof_int=4
ac_cv_sizeof_long=4
ac_cv_sizeof_long_long=8
ac_cv_sizeof_short=2
ac_cv_sizeof_size_t=4
ac_cv_sizeof_ssize_t=4
ac_cv_sizeof_void_p=4
ac_cv_sizeof_wchar_t=4
ac_cv_sys_restartable_syscalls=yes
ac_cv_target=arm-unknown-linux-gnu
ac_cv_target_alias=arm-linux
ac_cv_uchar=no
ac_cv_uint=yes
ac_cv_ulong=yes
ac_cv_ushort=yes
ac_cv_va_copy=no
ac_cv_va_val_copy=yes
am_cv_func_working_getline=yes
apr_cv_process_shared_works=no
bash_cv_dup2_broken=no
bash_cv_func_sigsetjmp=missing
bash_cv_func_strcoll_broken=no
bash_cv_getcwd_calls_popen=no
bash_cv_getenv_redef=yes
bash_cv_have_mbstate_t=yes
bash_cv_job_control_missing=present
bash_cv_must_reinstall_sighandlers=no
bash_cv_opendir_not_robust=no
bash_cv_pgrp_pipe=no
bash_cv_printf_a_format=yes
bash_cv_sys_named_pipes=present
bash_cv_sys_siglist=yes
bash_cv_type_rlimit=rlim_t
bash_cv_ulimit_maxfds=yes
bash_cv_under_sys_siglist=yes
bash_cv_unusable_rtsigs=no
cvs_cv_func_printf_ptr=yes
db_cv_align_t='unsigned long long'
db_cv_alignp_t='unsigned long'
db_cv_fcntl_f_setfd=yes
db_cv_mutex=x86/gcc-assembly
db_cv_path_ar=/usr/bin/ar
db_cv_path_chmod=/bin/chmod
db_cv_path_cp=/bin/cp
db_cv_path_ln=/bin/ln
db_cv_path_mkdir=/bin/mkdir
db_cv_path_ranlib=/usr/bin/ranlib
db_cv_path_rm=/bin/rm
db_cv_path_sh=/bin/sh
db_cv_path_strip=/usr/bin/strip
db_cv_posixmutexes=no
db_cv_sprintf_count=yes
db_cv_uimutexes=no
gcc_cv_decl_map_anon=yes
gcc_cv_func_mmap_anon=yes
gcc_cv_func_mmap_dev_zero=yes
gcc_cv_func_mmap_file=yes
glib_cv___va_copy=yes
glib_cv_has__inline=yes
glib_cv_has__inline__=yes
glib_cv_hasinline=yes
glib_cv_sane_realloc=yes
glib_cv_sizeof_gmutex=24
glib_cv_stack_grows=no
glib_cv_sys_pthread_cond_timedwait_posix=yes
glib_cv_sys_pthread_getspecific_posix=yes
glib_cv_sys_pthread_mutex_trylock_posix=yes
glib_cv_uscore=no
glib_cv_use_pid_surrogate=yes
glib_cv_va_copy=yes
glib_cv_va_val_copy=yes
jm_cv_func_working_readdir=yes
lf_cv_sane_realloc=yes
libIDL_cv_long_long_format=ll
mysql_cv_func_atomic_add=yes
mysql_cv_func_atomic_sub=yes
php_cv_lib_cookie_io_functions_use_off64_t=yes
racoon_cv_bug_getaddrinfo=no
rsync_cv_HAVE_BROKEN_LARGEFILE=no
rsync_cv_HAVE_BROKEN_READDIR=no
rsync_cv_HAVE_C99_VSNPRINTF=yes
rsync_cv_HAVE_GETTIMEOFDAY_TZ=yes
rsync_cv_HAVE_LONGLONG=yes
rsync_cv_HAVE_OFF64_T=no
rsync_cv_HAVE_SECURE_MKSTEMP=yes
rsync_cv_HAVE_SHORT_INO_T=no
rsync_cv_HAVE_SOCKETPAIR=yes
rsync_cv_HAVE_UNSIGNED_CHAR=no
rsync_cv_REPLACE_INET_ATON=no
rsync_cv_REPLACE_INET_NTOA=no
samba_cv_HAVE_GETTIMEOFDAY_TZ=yes
screen_cv_sys_bcopy_overlap=no
screen_cv_sys_fifo_broken_impl=yes
screen_cv_sys_fifo_usable=yes
screen_cv_sys_memcpy_overlap=no
screen_cv_sys_memmove_overlap=no
screen_cv_sys_select_broken_retval=no
screen_cv_sys_sockets_nofs=no
screen_cv_sys_sockets_usable=yes
screen_cv_sys_terminfo_used=yes
sudo_cv_uid_t_len=10
utils_cv_sys_open_max=1015

## ----------------- ##
## Output variables. ##
## ----------------- ##

CC='ccache gcc'
CFLAGS='-I/home/raphael/devel/zaurus/bitbake/tmp/staging/i686-linux/include -O2'
CPP='gcc -E'
CPPFLAGS='-I/home/raphael/devel/zaurus/bitbake/tmp/staging/i686-linux/include'
DEFS='-DHAVE_CONFIG_H'
ECHO_C=''
ECHO_N='-n'
ECHO_T=''
EGREP='grep -E'
EXEEXT=''
LDFLAGS='-L/home/raphael/devel/zaurus/bitbake/tmp/staging/i686-linux/lib -Wl,-rpath-link,/home/raphael/devel/zaurus/bitbake/tmp/staging/i686-linux/lib -Wl,-rpath,/home/raphael/devel/zaurus/bitbake/tmp/staging/i686-linux/lib -Wl,-O1'
LIBOBJS=''
LIBS=''
LTLIBOBJS=''
MAINT='#'
OBJEXT='o'
PACKAGE_BUGREPORT=''
PACKAGE_NAME='fixincludes'
PACKAGE_STRING='fixincludes  '
PACKAGE_TARNAME='fixincludes'
PACKAGE_VERSION=' '
PATH_SEPARATOR=':'
SHELL='/bin/sh'
TARGET='oneprocess'
ac_ct_CC=''
bindir='/home/raphael/devel/zaurus/bitbake/tmp/cross/bin'
build='i686-pc-linux-gnu'
build_alias='i686-linux'
build_cpu='i686'
build_os='linux-gnu'
build_vendor='pc'
datadir='/home/raphael/devel/zaurus/bitbake/tmp/cross/share'
exec_prefix='/home/raphael/devel/zaurus/bitbake/tmp/cross'
gcc_version='4.0.0'
gcc_version_full='4.0.0'
gcc_version_trigger='/home/raphael/devel/zaurus/bitbake/tmp/work/gcc-cross-4.0.0-r1/gcc-4.0.0/gcc/version.c'
host='i686-pc-linux-gnu'
host_alias='i686-linux'
host_cpu='i686'
host_os='linux-gnu'
host_vendor='pc'
includedir='/home/raphael/devel/zaurus/bitbake/tmp/cross/include'
infodir='/home/raphael/devel/zaurus/bitbake/tmp/cross/share/info'
libdir='/home/raphael/devel/zaurus/bitbake/tmp/cross/lib'
libexecdir='/home/raphael/devel/zaurus/bitbake/tmp/cross/libexec'
localstatedir='/home/raphael/devel/zaurus/bitbake/tmp/cross/var'
mandir='/home/raphael/devel/zaurus/bitbake/tmp/cross/share/man'
oldincludedir='/home/raphael/devel/zaurus/bitbake/tmp/cross/include'
prefix='/home/raphael/devel/zaurus/bitbake/tmp/cross'
program_transform_name='s,^,arm-linux-,; '
sbindir='/home/raphael/devel/zaurus/bitbake/tmp/cross/bin'
sharedstatedir='/home/raphael/devel/zaurus/bitbake/tmp/cross/com'
sysconfdir='/home/raphael/devel/zaurus/bitbake/tmp/cross/etc'
target='arm-unknown-linux-gnu'
target_alias='arm-linux'
target_cpu='arm'
target_noncanonical='arm-linux'
target_os='linux-gnu'
target_vendor='unknown'

## ----------- ##
## confdefs.h. ##
## ----------- ##

#define EXE_EXT ""
#define HAVE_DECL_ABORT 1
#define HAVE_DECL_ERRNO 0
#define HAVE_DECL_FPRINTF_UNLOCKED 0
#define HAVE_DECL_FPUTC_UNLOCKED 1
#define HAVE_DECL_FPUTS_UNLOCKED 0
#define HAVE_DECL_FWRITE_UNLOCKED 1
#define HAVE_DECL_PUTC_UNLOCKED 1
#define HAVE_FCNTL_H 1
#define HAVE_FPUTC_UNLOCKED 1
#define HAVE_FPUTS_UNLOCKED 1
#define HAVE_FWRITE_UNLOCKED 1
#define HAVE_INTTYPES_H 1
#define HAVE_MEMORY_H 1
#define HAVE_MMAP_ANON 1
#define HAVE_MMAP_DEV_ZERO 1
#define HAVE_MMAP_FILE 1
#define HAVE_PUTC_UNLOCKED 1
#define HAVE_STDDEF_H 1
#define HAVE_STDINT_H 1
#define HAVE_STDLIB_H 1
#define HAVE_STDLIB_H 1
#define HAVE_STRINGS_H 1
#define HAVE_STRINGS_H 1
#define HAVE_STRING_H 1
#define HAVE_SYS_FILE_H 1
#define HAVE_SYS_STAT_H 1
#define HAVE_SYS_STAT_H 1
#define HAVE_SYS_TYPES_H 1
#define HAVE_UNISTD_H 1
#define HAVE_UNISTD_H 1
#define PACKAGE_BUGREPORT ""
#define PACKAGE_NAME "fixincludes"
#define PACKAGE_STRING "fixincludes  "
#define PACKAGE_TARNAME "fixincludes"
#define PACKAGE_VERSION " "
#define STDC_HEADERS 1

configure: exit 0