root@nor-sw:/usr/src/wanpipe/util/wan_aftup# ./update_aft_firm.sh
wan_aftup.c:91: error: `AFT_4TE1_SHARK_SUBSYS_VENDOR' undeclared here (not in a function)
wan_aftup.c:91: error: initializer element is not constant
wan_aftup.c:91: error: (near initialization for `aft_core_table[5].board_id')
wan_aftup.c:91: error: `AFT_PMC_FE_CORE_ID' undeclared here (not in a function)
wan_aftup.c:91: error: initializer element is not constant
wan_aftup.c:91: error: (near initialization for `aft_core_table[5].core_id')
wan_aftup.c:92: error: initializer element is not constant
wan_aftup.c:92: error: (near initialization for `aft_core_table[5]')
wan_aftup.c:93: error: `AFT_4TE1_SHARK_SUBSYS_VENDOR' undeclared here (not in a function)
wan_aftup.c:93: error: initializer element is not constant
wan_aftup.c:93: error: (near initialization for `aft_core_table[6].board_id')
wan_aftup.c:93: error: `AFT_PMC_FE_CORE_ID' undeclared here (not in a function)
wan_aftup.c:93: error: initializer element is not constant
wan_aftup.c:93: error: (near initialization for `aft_core_table[6].core_id')
wan_aftup.c:94: error: initializer element is not constant
wan_aftup.c:94: error: (near initialization for `aft_core_table[6]')
wan_aftup.c:95: error: `AFT_2TE1_SHARK_SUBSYS_VENDOR' undeclared here (not in a function)
wan_aftup.c:95: error: initializer element is not constant
wan_aftup.c:95: error: (near initialization for `aft_core_table[7].board_id')
wan_aftup.c:95: error: `AFT_DS_FE_CORE_ID' undeclared here (not in a function)
wan_aftup.c:95: error: initializer element is not constant
wan_aftup.c:95: error: (near initialization for `aft_core_table[7].core_id')
wan_aftup.c:96: error: initializer element is not constant
wan_aftup.c:96: error: (near initialization for `aft_core_table[7]')
wan_aftup.c:97: error: `AFT_4TE1_SHARK_SUBSYS_VENDOR' undeclared here (not in a function)
wan_aftup.c:97: error: initializer element is not constant
wan_aftup.c:97: error: (near initialization for `aft_core_table[8].board_id')
wan_aftup.c:97: error: `AFT_DS_FE_CORE_ID' undeclared here (not in a function)
wan_aftup.c:97: error: initializer element is not constant
wan_aftup.c:97: error: (near initialization for `aft_core_table[8].core_id')
wan_aftup.c:98: error: initializer element is not constant
wan_aftup.c:98: error: (near initialization for `aft_core_table[8]')
wan_aftup.c:99: error: `AFT_8TE1_SHARK_SUBSYS_VENDOR' undeclared here (not in a function)
wan_aftup.c:99: error: initializer element is not constant
wan_aftup.c:99: error: (near initialization for `aft_core_table[9].board_id')
wan_aftup.c:99: error: `AFT_DS_FE_CORE_ID' undeclared here (not in a function)
wan_aftup.c:99: error: initializer element is not constant
wan_aftup.c:99: error: (near initialization for `aft_core_table[9].core_id')
wan_aftup.c:100: error: initializer element is not constant
wan_aftup.c:100: error: (near initialization for `aft_core_table[9]')
wan_aftup.c:101: error: `AFT_ANALOG_FE_CORE_ID' undeclared here (not in a function)
wan_aftup.c:101: error: initializer element is not constant
wan_aftup.c:101: error: (near initialization for `aft_core_table[10].core_id')
wan_aftup.c:102: error: initializer element is not constant
wan_aftup.c:102: error: (near initialization for `aft_core_table[10]')
wan_aftup.c:103: error: `AFT_ANALOG_FE_CORE_ID' undeclared here (not in a function)
wan_aftup.c:103: error: initializer element is not constant
wan_aftup.c:103: error: (near initialization for `aft_core_table[11].core_id')
wan_aftup.c:104: error: initializer element is not constant
wan_aftup.c:104: error: (near initialization for `aft_core_table[11]')
wan_aftup.c:105: error: `AFT_ANALOG_FE_CORE_ID' undeclared here (not in a function)
wan_aftup.c:105: error: initializer element is not constant
wan_aftup.c:105: error: (near initialization for `aft_core_table[12].core_id')
wan_aftup.c:106: error: initializer element is not constant
wan_aftup.c:106: error: (near initialization for `aft_core_table[12]')
wan_aftup.c:108: error: initializer element is not constant
wan_aftup.c:108: error: (near initialization for `aft_core_table[13]')
wan_aftup.c:117: error: initializer element is not constant
wan_aftup.c:117: error: (near initialization for `aft_core_table[14]')
wan_aftup.c: In function `wan_aftup_program':
wan_aftup.c:581: error: `AFT_2TE1_SHARK_SUBSYS_VENDOR' undeclared (first use in this function)
wan_aftup.c:581: error: (Each undeclared identifier is reported only once
wan_aftup.c:581: error: for each function it appears in.)
wan_aftup.c:584: error: `AFT_4TE1_SHARK_SUBSYS_VENDOR' undeclared (first use in this function)
wan_aftup.c:587: error: `AFT_8TE1_SHARK_SUBSYS_VENDOR' undeclared (first use in this function)
wan_aft_prg.c: In function `board_reset':
wan_aft_prg.c:572: error: `AFT_4TE1_SHARK_SUBSYS_VENDOR' undeclared (first use in this function)
wan_aft_prg.c:572: error: (Each undeclared identifier is reported only once
wan_aft_prg.c:572: error: for each function it appears in.)
wan_aft_prg.c:573: error: `AFT_2TE1_SHARK_SUBSYS_VENDOR' undeclared (first use in this function)
wan_aft_prg.c:574: error: `AFT_8TE1_SHARK_SUBSYS_VENDOR' undeclared (first use in this function)
wan_aft_prg.c:576: error: `AFT_PMC_FE_CORE_ID' undeclared (first use in this function)
wan_aft_prg.c:589: error: `AFT_DS_FE_CORE_ID' undeclared (first use in this function)
wan_aft_prg.c: At top level:
wan_aft_prg.c:173: warning: `set_board_reset' declared `static' but never defined
make: *** [wan_aftup] Error 1
modprobe wan_aften > /dev/null
AFT card enabled
./update_aft_firm.sh: line 27: ./wan_aftup: No such file or directory
modprobe -r wan_aften
AFT card disabled