All pastes #222690 Raw Edit

thefox

public text v1 · immutable
#222690 ·published 2006-10-26 14:11 UTC
rendered paste body
[thefox@foxie bully]$ make
Makefile:152: warning: overriding commands for target `moc_bully.cpp'
Makefile:149: warning: ignoring old commands for target `moc_bully.cpp'
g++ -c -pipe -Wall -W -O2  -DQT_NO_DEBUG -DQT_SHARED -DQT_THREAD_SUPPORT -I/usr/l
ib/qt/mkspecs/default -I. -I. -I/usr/lib/qt/include -o main.o main.cpp
main.cpp:20:24: QApplication: No such file or directory
In file included from main.cpp:21:
bully.h:23:19: QWidget: No such file or directory
bully.h:24:19: QString: No such file or directory
bully.h:25:22: ui_bully.h: No such file or directory
In file included from main.cpp:21:
bully.h:29: error: parse error before `,' token
bully.h:36: error: parse error before `private'
main.cpp: In function `int main(int, char**)':
main.cpp:24: error: `QApplication' undeclared (first use this function)
main.cpp:24: error: (Each undeclared identifier is reported only once for each 
   function it appears in.)
main.cpp:24: error: parse error before `(' token
main.cpp:25: error: `QString' undeclared (first use this function)
main.cpp:27: error: `mess' undeclared (first use this function)
main.cpp:28: error: variable `Bully b' has initializer but incomplete type
main.cpp:29: error: `app' undeclared (first use this function)
main.cpp:28: warning: unused variable `<typeprefixerror> b'
make: *** [main.o] Error 1
[thefox@foxie bully]$ qmake
WARNING: Found potential symbol conflict of bully.cpp (bully.cpp) in SOURCES
WARNING: Found potential symbol conflict of bully.h (bully.h) in HEADERS
[thefox@foxie bully]$ make
Makefile:151: warning: overriding commands for target `moc_bully.cpp'
Makefile:148: warning: ignoring old commands for target `moc_bully.cpp'
g++ -c -pipe -Wall -W -O2  -DQT_NO_DEBUG -DQT_SHARED -DQT_THREAD_SUPPORT -I/usr/l
ib/qt/mkspecs/default -I. -I. -I/usr/lib/qt/include -o main.o main.cpp
main.cpp:20:24: QApplication: No such file or directory
In file included from main.cpp:21:
bully.h:23:19: QWidget: No such file or directory
bully.h:24:19: QString: No such file or directory
bully.h:25:22: ui_bully.h: No such file or directory
In file included from main.cpp:21:
bully.h:29: error: parse error before `,' token
bully.h:36: error: parse error before `private'
main.cpp: In function `int main(int, char**)':
main.cpp:24: error: `QApplication' undeclared (first use this function)
main.cpp:24: error: (Each undeclared identifier is reported only once for each 
   function it appears in.)
main.cpp:24: error: parse error before `(' token
main.cpp:25: error: `QString' undeclared (first use this function)
main.cpp:27: error: `mess' undeclared (first use this function)
main.cpp:28: error: variable `Bully b' has initializer but incomplete type
main.cpp:29: error: `app' undeclared (first use this function)
main.cpp:28: warning: unused variable `<typeprefixerror> b'