All pastes #222063 Raw Edit

Something

public text v1 · immutable
#222063 ·published 2006-10-26 01:16 UTC
rendered paste body
/usr/lib/gcc/x86_64-pc-linux-gnu/4.1.1/../../../../x86_64-pc-linux-gnu/bin/ld: warning: libssl.so.0.9.7, needed by /usr/lib64/libmysqlclient.so, may conflict with libssl.so.0.9.8
/usr/lib/gcc/x86_64-pc-linux-gnu/4.1.1/../../../../x86_64-pc-linux-gnu/bin/ld: warning: libcrypto.so.0.9.7, needed by /usr/lib64/libmysqlclient.so, may conflict with libcrypto.so.0.9.8
/usr/lib64/libGLcore.so.1: undefined reference to `_nv000037gl'
collect2: ld returned 1 exit status
make[4]: *** [amarokapp] Error 1
make[4]: Leaving directory `/var/tmp/portage/amarok-1.4.3-r1/work/amarok-1.4.3/amarok/src'
make[3]: *** [all-recursive] Error 1
make[3]: Leaving directory `/var/tmp/portage/amarok-1.4.3-r1/work/amarok-1.4.3/amarok/src'
make[2]: *** [all-recursive] Error 1
make[2]: Leaving directory `/var/tmp/portage/amarok-1.4.3-r1/work/amarok-1.4.3/amarok'
make[1]: *** [all-recursive] Error 1
make[1]: Leaving directory `/var/tmp/portage/amarok-1.4.3-r1/work/amarok-1.4.3'
make: *** [all] Error 2

!!! ERROR: media-sound/amarok-1.4.3-r1 failed.
Call stack:
  ebuild.sh, line 1546:   Called dyn_compile
  ebuild.sh, line 937:   Called src_compile
  amarok-1.4.3-r1.ebuild, line 75:   Called kde_src_compile
  kde.eclass, line 171:   Called kde_src_compile 'all'
  kde.eclass, line 341:   Called kde_src_compile 'myconf' 'configure' 'make'
  kde.eclass, line 337:   Called die

!!! died running emake, kde_src_compile:make
!!! If you need support, post the topmost build error, and the call stack if relevant.