cd c++ && make DESDIR="" all
make[1]: Entering directory '/var/tmp/portage/ncurses-5.5-r3/work/naroowc/c++
cd ../obj_s; -I../c++ -I../include -I/var/tmp/portage/ncurses-5.5-r3/work/ncurses-5.5/c++ -DHAVE_CONFIG_H -I/var/tmp/portage/ncurses-5.5-r3/work/ncurses-5.5/c++/../include -I. -I../include -D_GNU_SOURCE -DNDEBUG -O2 -march=k6-2 -pipe -fPIC -c /var/tmp/portage/ncurses-5.5-r3/work/ncurses-5.5/c++/cursesf.cc
cd ../obj_s; -I../c++ -I../include -I/var/tmp/portage/ncurses-5.5-r3/work/ncurses-5.5/c++ -DHAVE_CONFIG_H -I/var/tmp/portage/ncurses-5.5-r3/work/ncurses-5.5/c++/../include -I. -I../include -D_GNU_SOURCE -DNDEBUG -O2 -march=k6-2 -pipe -fPIC -c /var/tmp/portage/ncurses-5.5-r3/work/ncurses-5.5/c++/cursesm.cc
/bin/sh: -I../c++: No such file or directory
make[1]: *** [../obj_s/cursesf.o] Error 127
/bin/sh: -I../c++: No such file or directory
make[1]: *** Waiting for unfinished jobs....
make[1]: *** [../obj_s/cursesm.o] Error 127
make[1]: Leaving directory '/var/tmp/portage/ncurses-5.5-r3/work/narrowc/c++'
make: *** [all] Error 2
!!! ERROR: sys-libs/ncurses-5.5-r3 failed.
Call stack:
ebuild.sh, line 1546: called dyn_compile
ebuild.sh, line 937L: Called src_compile
ncurses-5.5-r3.ebuild, line 50: Called do_compile
ncurses-5.5-r3.ebuild, line 93: Called die
!!! make failed
!!! If you need support, post the topmost build error, and the call stack if relevant.