All pastes #219656 Raw Edit

gdm in laptop

public text v1 · immutable
#219656 ·published 2006-10-24 20:18 UTC
rendered paste body
/usr/lib/libgdk-x11-2.0.so: undefined reference to `cairo_xlib_surface_create'
/usr/lib/libgdk-x11-2.0.so: undefined reference to `cairo_xlib_surface_set_size'
collect2: ld returned 1 exit status
make[2]: *** [rsvg-view] Error 1
make[2]: *** Waiting for unfinished jobs....
i686-pc-linux-gnu-gcc -O2 -march=pentium3 -pipe -o .libs/test-performance test-performance.o  -pthread ./.libs/librsvg-2.so /usr/lib/libgnomevfs-2.so -lssl -lcrypto -lresolv -lutil -lrt /usr/lib/libbonobo-2.so /usr/lib/libgconf-2.so /usr/lib/libbonobo-activation.so /usr/lib/libORBitCosNaming-2.so /usr/lib/libORBit-2.so /usr/lib/libpopt.so /usr/lib/libgthread-2.0.so -lpthread /usr/lib/libgsf-1.so /usr/lib/libcroco-0.6.so /usr/lib/libgdk_pixbuf-2.0.so /usr/lib/libxml2.so /usr/lib/libpangoft2-1.0.so /usr/lib/libpango-1.0.so /usr/lib/libgobject-2.0.so /usr/lib/libgmodule-2.0.so -ldl /usr/lib/libglib-2.0.so /usr/lib/libcairo.so /usr/lib/libpng12.so /usr/lib/libfontconfig.so /usr/lib/libexpat.so /usr/lib/libfreetype.so -lz -lm
creating test-performance
make[2]: Leaving directory `/var/tmp/portage/librsvg-2.14.4/work/librsvg-2.14.4'
make[1]: *** [all-recursive] Error 1
make[1]: Leaving directory `/var/tmp/portage/librsvg-2.14.4/work/librsvg-2.14.4'
make: *** [all] Error 2

!!! ERROR: gnome-base/librsvg-2.14.4 failed.
Call stack:
  ebuild.sh, line 1546:   Called dyn_compile
  ebuild.sh, line 937:   Called src_compile
  ebuild.sh, line 1255:   Called gnome2_src_compile
  gnome2.eclass, line 64:   Called die

!!! compile failure
!!! If you need support, post the topmost build error, and the call stack if relevant.