p/staging/arm-linux/include/glib-2.0 -I/home/enpsgp/dev/build/tmp/staging/arm-linux/lib/glib-2.0/include -I/home/enpsgp/dev/build/tmp/staging/arm-linux/include/freetype2 -I/home/enpsgp/dev/build/tmp/staging/arm-linux/lib/../include/libpng12 -I/home/enpsgp/dev/build/tmp/staging/arm-linux/include/matchbox-desktop -I/home/enpsgp/dev/build/tmp/staging/arm-linux/include -g -DDATADIR=\"/usr/share\" -I/home/enpsgp/dev/build/tmp/staging/arm-linux/include -I/home/enpsgp/dev/build/tmp/staging/arm-linux/include -fexpensive-optimizations -fomit-frame-pointer -frename-registers -O2 -MT xinebrowser_callbacks.lo -MD -MP -MF .deps/xinebrowser_callbacks.Tpo -c xinebrowser_callbacks.c -fPIC -DPIC -o .libs/xinebrowser_callbacks.o
| In file included from /home/enpsgp/dev/build/tmp/staging/arm-linux/include/matchbox-desktop/mbdesktop.h:5,
| from /home/enpsgp/dev/build/tmp/staging/arm-linux/include/matchbox-desktop/mbdesktop_module.h:4,
| from xinebrowser.h:23,
| from xinebrowser_callbacks.c:16:
| ./config.h:24:1: warning: "HAVE_STDLIB_H" redefined
| In file included from /home/enpsgp/dev/build/tmp/staging/arm-linux/include/jpeglib.h:24,
| from /home/enpsgp/dev/build/tmp/staging/arm-linux/include/libmb/mbpixbuf.h:48,
| from /home/enpsgp/dev/build/tmp/staging/arm-linux/include/libmb/mb.h:27,
| from xinebrowser.h:22,
| from xinebrowser_callbacks.c:16:
| /home/enpsgp/dev/build/tmp/staging/arm-linux/include/jconfig.h:12:1: warning: this is the location of the previous definition
| In file included from xinebrowser.h:26,
| from xinebrowser_callbacks.c:16:
| /home/enpsgp/dev/build/tmp/staging/arm-linux/include/xine/xineutils.h:1042: warning: "struct timezone" declared inside parameter list
| /home/enpsgp/dev/build/tmp/staging/arm-linux/include/xine/xineutils.h:1042: warning: its scope is only this definition or declaration, which is probably not what you want
| xinebrowser_callbacks.c: In function `xinebrowser_movie_open_cb':
| xinebrowser_callbacks.c:280: error: `alphasort' undeclared (first use in this function)
| xinebrowser_callbacks.c:280: error: (Each undeclared identifier is reported only once
| xinebrowser_callbacks.c:280: error: for each function it appears in.)
| xinebrowser_callbacks.c: In function `xinebrowser_music_open_cb':
| xinebrowser_callbacks.c:507: error: `alphasort' undeclared (first use in this function)
| make[2]: *** [xinebrowser_callbacks.lo] Error 1
| make[2]: Leaving directory `/home/enpsgp/dev/build/tmp/work/mb-desktop-xine-0.4-r0/mb-desktop-xine-0.4'
| make[1]: *** [all-recursive] Error 1
| make[1]: Leaving directory `/home/enpsgp/dev/build/tmp/work/mb-desktop-xine-0.4-r0/mb-desktop-xine-0.4'
| make: *** [all] Error 2
| FATAL: oe_runmake failed
NOTE: Task failed:
NOTE: package mb-desktop-xine-0.4-r0: task do_compile: failed
ERROR: TaskFailed event exception, aborting
NOTE: package mb-desktop-xine-0.4: failed
ERROR: Build of mb-desktop-xine failed