rendered paste bodyNOTE: package gnumeric-1.5.3: started
NOTE: package gnumeric-1.5.3-r0: task do_fetch: started
NOTE: package gnumeric-1.5.3-r0: task do_fetch: completed
NOTE: package gnumeric-1.5.3-r0: task do_compile: started
ERROR: function do_compile failed
ERROR: log data follows (/home/enpsgp/dev/build/tmp/work/gnumeric-1.5.3-r0/temp/log.do_compile.27904)
| NOTE: make
| make all-recursive
| make[1]: Entering directory `/home/enpsgp/dev/build/tmp/work/gnumeric-1.5.3-r0/gnumeric-1.5.3'
| Making all in .
| make[2]: Entering directory `/home/enpsgp/dev/build/tmp/work/gnumeric-1.5.3-r0/gnumeric-1.5.3'
| make[2]: Nothing to be done for `all-am'.
| make[2]: Leaving directory `/home/enpsgp/dev/build/tmp/work/gnumeric-1.5.3-r0/gnumeric-1.5.3'
| Making all in po
| make[2]: Entering directory `/home/enpsgp/dev/build/tmp/work/gnumeric-1.5.3-r0/gnumeric-1.5.3/po'
| make[2]: Nothing to be done for `all'.
| make[2]: Leaving directory `/home/enpsgp/dev/build/tmp/work/gnumeric-1.5.3-r0/gnumeric-1.5.3/po'
| Making all in po-functions
| make[2]: Entering directory `/home/enpsgp/dev/build/tmp/work/gnumeric-1.5.3-r0/gnumeric-1.5.3/po-functions'
| make[2]: Nothing to be done for `all'.
| make[2]: Leaving directory `/home/enpsgp/dev/build/tmp/work/gnumeric-1.5.3-r0/gnumeric-1.5.3/po-functions'
| Making all in src
| make[2]: Entering directory `/home/enpsgp/dev/build/tmp/work/gnumeric-1.5.3-r0/gnumeric-1.5.3/src'
| make all-recursive
| make[3]: Entering directory `/home/enpsgp/dev/build/tmp/work/gnumeric-1.5.3-r0/gnumeric-1.5.3/src'
| Making all in tools
| make[4]: Entering directory `/home/enpsgp/dev/build/tmp/work/gnumeric-1.5.3-r0/gnumeric-1.5.3/src/tools'
| Making all in solver
| make[5]: Entering directory `/home/enpsgp/dev/build/tmp/work/gnumeric-1.5.3-r0/gnumeric-1.5.3/src/tools/solver'
| Making all in glpk
| make[6]: Entering directory `/home/enpsgp/dev/build/tmp/work/gnumeric-1.5.3-r0/gnumeric-1.5.3/src/tools/solver/glpk'
| Making all in source
| make[7]: Entering directory `/home/enpsgp/dev/build/tmp/work/gnumeric-1.5.3-r0/gnumeric-1.5.3/src/tools/solver/glpk/source'
| make[8]: Entering directory `/home/enpsgp/dev/build/tmp/work/gnumeric-1.5.3-r0/gnumeric-1.5.3/src/tools/solver/glpk/source'
| make[8]: Nothing to be done for `all-am'.
| make[8]: Leaving directory `/home/enpsgp/dev/build/tmp/work/gnumeric-1.5.3-r0/gnumeric-1.5.3/src/tools/solver/glpk/source'
| make[7]: Leaving directory `/home/enpsgp/dev/build/tmp/work/gnumeric-1.5.3-r0/gnumeric-1.5.3/src/tools/solver/glpk/source'
| Making all in include
| make[7]: Entering directory `/home/enpsgp/dev/build/tmp/work/gnumeric-1.5.3-r0/gnumeric-1.5.3/src/tools/solver/glpk/include'
| make[7]: Nothing to be done for `all'.
| make[7]: Leaving directory `/home/enpsgp/dev/build/tmp/work/gnumeric-1.5.3-r0/gnumeric-1.5.3/src/tools/solver/glpk/include'
| make[7]: Entering directory `/home/enpsgp/dev/build/tmp/work/gnumeric-1.5.3-r0/gnumeric-1.5.3/src/tools/solver/glpk'
| make[7]: Nothing to be done for `all-am'.
| make[7]: Leaving directory `/home/enpsgp/dev/build/tmp/work/gnumeric-1.5.3-r0/gnumeric-1.5.3/src/tools/solver/glpk'
| make[6]: Leaving directory `/home/enpsgp/dev/build/tmp/work/gnumeric-1.5.3-r0/gnumeric-1.5.3/src/tools/solver/glpk'
| Making all in lp_solve
| make[6]: Entering directory `/home/enpsgp/dev/build/tmp/work/gnumeric-1.5.3-r0/gnumeric-1.5.3/src/tools/solver/lp_solve'
| if /bin/sh ../../../../arm-linux-libtool --tag=CC --mode=compile ccache arm-linux-gcc -march=armv5te -mtune=xscale -DHAVE_CONFIG_H -I. -I/home/enpsgp/dev/build/tmp/work/gnumeric-1.5.3-r0/gnumeric-1.5.3/src/tools/solver/lp_solve -I../../../.. -DGNOMELOCALEDIR=\""/usr/share/locale"\" -I/home/enpsgp/dev/build/tmp/work/gnumeric-1.5.3-r0/gnumeric-1.5.3 -I/home/enpsgp/dev/build/tmp/work/gnumeric-1.5.3-r0/gnumeric-1.5.3/src -I/home/enpsgp/dev/build/tmp/work/gnumeric-1.5.3-r0/gnumeric-1.5.3/src/tools -I/home/enpsgp/dev/build/tmp/work/gnumeric-1.5.3-r0/gnumeric-1.5.3/src/tools/solver -I/home/enpsgp/dev/build/tmp/work/gnumeric-1.5.3-r0/gnumeric-1.5.3/src/tools/solver/lp_solve -include ../../../../gnumeric-config.h -D_XOPEN_SOURCE=500 -I/home/enpsgp/dev/build/tmp/staging/arm-linux/include/glib-2.0 -I/home/enpsgp/dev/build/tmp/staging/arm-linux/lib/glib-2.0/include -I/home/enpsgp/dev/build/tmp/staging/arm-linux/include/libgsf-1 -I/home/enpsgp/dev/build/tmp/staging/arm-linux/include/libxml2 -I/home/enpsgp/dev/build/tmp/staging/arm-linux/include/libgoffice-1 -I/home/enpsgp/dev/build/tmp/staging/arm-linux/include/gtk-2.0 -I/home/enpsgp/dev/build/tmp/staging/arm-linux/include/libglade-2.0 -I/home/enpsgp/dev/build/tmp/staging/arm-linux/include/libgnomeprint-2.2 -I/home/enpsgp/dev/build/tmp/staging/arm-linux/include/libart-2.0 -I/home/enpsgp/dev/build/tmp/staging/arm-linux/lib/gtk-2.0/include -I/home/enpsgp/dev/build/tmp/staging/arm-linux/include -I/home/enpsgp/dev/build/tmp/staging/arm-linux/include/atk-1.0 -I/home/enpsgp/dev/build/tmp/staging/arm-linux/include/pango-1.0 -I/home/enpsgp/dev/build/tmp/staging/arm-linux/include/freetype2 -I/home/enpsgp/dev/build/tmp/staging/arm-linux/include/libgnomeprintui-2.2 -I/home/enpsgp/dev/build/tmp/staging/arm-linux/include/libgnomecanvas-2.0 -DYY_NEVER_INTERACTIVE -DPARSER_CPLEX -DPARSER_LP -I/home/enpsgp/dev/build/tmp/staging/arm-linux/include -I/home/enpsgp/dev/build/tmp/staging/arm-linux/include -fexpensive-optimizations -fomit-frame-pointer -O2 -DG_DISABLE_DEPRECATED -DPANGO_DISABLE_DEPRECATED -DGDK_PIXBUF_DISABLE_DEPRECATED -DGDK_DISABLE_DEPRECATED -DGDK_MULTIHEAD_SAFE -DGTK_DISABLE_DEPRECATED -DLIBGLADE_DISABLE_DEPRECATED -Wall -Wmissing-prototypes -Wsign-compare -Wpointer-arith -Wnested-externs -Wchar-subscripts -Wwrite-strings -Wdeclaration-after-statement -Wnested-externs -Wmissing-noreturn -Wstrict-prototypes -Wmissing-prototypes -Wmissing-format-attribute -Wmissing-declarations -MT commonlib.lo -MD -MP -MF ".deps/commonlib.Tpo" -c -o commonlib.lo commonlib.c; \
| then mv -f ".deps/commonlib.Tpo" ".deps/commonlib.Plo"; else rm -f ".deps/commonlib.Tpo"; exit 1; fi
| ccache arm-linux-gcc -march=armv5te -mtune=xscale -DHAVE_CONFIG_H -I. -I/home/enpsgp/dev/build/tmp/work/gnumeric-1.5.3-r0/gnumeric-1.5.3/src/tools/solver/lp_solve -I../../../.. -DGNOMELOCALEDIR=\"/usr/share/locale\" -I/home/enpsgp/dev/build/tmp/work/gnumeric-1.5.3-r0/gnumeric-1.5.3 -I/home/enpsgp/dev/build/tmp/work/gnumeric-1.5.3-r0/gnumeric-1.5.3/src -I/home/enpsgp/dev/build/tmp/work/gnumeric-1.5.3-r0/gnumeric-1.5.3/src/tools -I/home/enpsgp/dev/build/tmp/work/gnumeric-1.5.3-r0/gnumeric-1.5.3/src/tools/solver -I/home/enpsgp/dev/build/tmp/work/gnumeric-1.5.3-r0/gnumeric-1.5.3/src/tools/solver/lp_solve -include ../../../../gnumeric-config.h -D_XOPEN_SOURCE=500 -I/home/enpsgp/dev/build/tmp/staging/arm-linux/include/glib-2.0 -I/home/enpsgp/dev/build/tmp/staging/arm-linux/lib/glib-2.0/include -I/home/enpsgp/dev/build/tmp/staging/arm-linux/include/libgsf-1 -I/home/enpsgp/dev/build/tmp/staging/arm-linux/include/libxml2 -I/home/enpsgp/dev/build/tmp/staging/arm-linux/include/libgoffice-1 -I/home/enpsgp/dev/build/tmp/staging/arm-linux/include/gtk-2.0 -I/home/enpsgp/dev/build/tmp/staging/arm-linux/include/libglade-2.0 -I/home/enpsgp/dev/build/tmp/staging/arm-linux/include/libgnomeprint-2.2 -I/home/enpsgp/dev/build/tmp/staging/arm-linux/include/libart-2.0 -I/home/enpsgp/dev/build/tmp/staging/arm-linux/lib/gtk-2.0/include -I/home/enpsgp/dev/build/tmp/staging/arm-linux/include -I/home/enpsgp/dev/build/tmp/staging/arm-linux/include/atk-1.0 -I/home/enpsgp/dev/build/tmp/staging/arm-linux/include/pango-1.0 -I/home/enpsgp/dev/build/tmp/staging/arm-linux/include/freetype2 -I/home/enpsgp/dev/build/tmp/staging/arm-linux/include/libgnomeprintui-2.2 -I/home/enpsgp/dev/build/tmp/staging/arm-linux/include/libgnomecanvas-2.0 -DYY_NEVER_INTERACTIVE -DPARSER_CPLEX -DPARSER_LP -I/home/enpsgp/dev/build/tmp/staging/arm-linux/include -I/home/enpsgp/dev/build/tmp/staging/arm-linux/include -fexpensive-optimizations -fomit-frame-pointer -O2 -DG_DISABLE_DEPRECATED -DPANGO_DISABLE_DEPRECATED -DGDK_PIXBUF_DISABLE_DEPRECATED -DGDK_DISABLE_DEPRECATED -DGDK_MULTIHEAD_SAFE -DGTK_DISABLE_DEPRECATED -DLIBGLADE_DISABLE_DEPRECATED -Wall -Wmissing-prototypes -Wsign-compare -Wpointer-arith -Wnested-externs -Wchar-subscripts -Wwrite-strings -Wdeclaration-after-statement -Wnested-externs -Wmissing-noreturn -Wstrict-prototypes -Wmissing-prototypes -Wmissing-format-attribute -Wmissing-declarations -MT commonlib.lo -MD -MP -MF .deps/commonlib.Tpo -c commonlib.c -fPIC -DPIC -o .libs/commonlib.o
| In file included from commonlib.c:19:
| commonlib.h:138: warning: function declaration isn't a prototype
| commonlib.c:281: warning: function declaration isn't a prototype
| commonlib.c: In function `timeNow':
| commonlib.c:288: error: storage size of 'tzbuf' isn't known
| commonlib.c:288: warning: unused variable `tzbuf'
| make[6]: *** [commonlib.lo] Error 1
| make[6]: Leaving directory `/home/enpsgp/dev/build/tmp/work/gnumeric-1.5.3-r0/gnumeric-1.5.3/src/tools/solver/lp_solve'
| make[5]: *** [all-recursive] Error 1
| make[5]: Leaving directory `/home/enpsgp/dev/build/tmp/work/gnumeric-1.5.3-r0/gnumeric-1.5.3/src/tools/solver'
| make[4]: *** [all-recursive] Error 1
| make[4]: Leaving directory `/home/enpsgp/dev/build/tmp/work/gnumeric-1.5.3-r0/gnumeric-1.5.3/src/tools'
| make[3]: *** [all-recursive] Error 1
| make[3]: Leaving directory `/home/enpsgp/dev/build/tmp/work/gnumeric-1.5.3-r0/gnumeric-1.5.3/src'
| make[2]: *** [all] Error 2
| make[2]: Leaving directory `/home/enpsgp/dev/build/tmp/work/gnumeric-1.5.3-r0/gnumeric-1.5.3/src'
| make[1]: *** [all-recursive] Error 1
| make[1]: Leaving directory `/home/enpsgp/dev/build/tmp/work/gnumeric-1.5.3-r0/gnumeric-1.5.3'
| make: *** [all] Error 2
| FATAL: oe_runmake failed
NOTE: Task failed:
NOTE: package gnumeric-1.5.3-r0: task do_compile: failed
ERROR: TaskFailed event exception, aborting
NOTE: package gnumeric-1.5.3: failed
ERROR: Build of gnumeric failed