All pastes #219180 Raw Edit

Miscellany

public text v1 · immutable
#219180 ·published 2006-10-24 15:20 UTC
rendered paste body
make[3]: Entering directory `/home/martyn/arm-build/it7-vfs/2-16-upstream-merge/doc'
*** Scanning header files ***
if grep -l '^..*$' ./gnome-vfs-2.0.types > /dev/null ; then \
    CC="/bin/sh ../libtool --mode=compile cc   -g -Wall -O2" LD="/bin/sh ../libtool --mode=link cc  -g -Wall -O2 " CFLAGS="-I..  -D_REENTRANT -I/usr/include/glib-2.0 -I/usr/lib/glib-2.0/include -I/usr/include/gconf/2 -I/usr/include/dbus-1.0 -I/usr/lib/dbus-1.0/include -I/usr/include/libxml2      " LDFLAGS="-lgmodule-2.0 -ldl -lgthread-2.0 -lgobject-2.0 -lgconf-2 -lxml2 -lpthread -lz -lm -ldbus-glib-1 -ldbus-1 -lglib-2.0       -lresolv ../libgnomevfs/libgnomevfs-2.la" gtkdoc-scangobj  --module=gnome-vfs-2.0 --output-dir=. ; \
else \
    cd . ; \
    for i in gnome-vfs-2.0.args gnome-vfs-2.0.hierarchy gnome-vfs-2.0.interfaces gnome-vfs-2.0.prerequisites gnome-vfs-2.0.signals ; do \
               test -f $i || touch $i ; \
    done \
fi
mkdir .libs
 cc -g -Wall -O2 -I.. -D_REENTRANT -I/usr/include/glib-2.0 -I/usr/lib/glib-2.0/include -I/usr/include/gconf/2 -I/usr/include/dbus-1.0 -I/usr/lib/dbus-1.0/include -I/usr/include/libxml2 -c gnome-vfs-2.0-scan.c  -fPIC -DPIC -o .libs/gnome-vfs-2.0-scan.o
 cc -g -Wall -O2 -I.. -D_REENTRANT -I/usr/include/glib-2.0 -I/usr/lib/glib-2.0/include -I/usr/include/gconf/2 -I/usr/include/dbus-1.0 -I/usr/lib/dbus-1.0/include -I/usr/include/libxml2 -c gnome-vfs-2.0-scan.c -o gnome-vfs-2.0-scan.o >/dev/null 2>&1
cc -g -Wall -O2 -o .libs/gnome-vfs-2.0-scan .libs/gnome-vfs-2.0-scan.o  ../libgnomevfs/.libs/libgnomevfs-2.so /usr/lib/libgthread-2.0.so /usr/lib/libgconf-2.so /usr/lib/libgmodule-2.0.so -ldl /usr/lib/libgobject-2.0.so /usr/lib/libxml2.so -lpthread -lz -lm -ldbus-glib-1 -ldbus-1 /usr/lib/libglib-2.0.so -lresolv -lutil -lrt 
creating gnome-vfs-2.0-scan
Scan failed
make[3]: *** [scan-build.stamp] Error 9
make[3]: Leaving directory `/home/martyn/arm-build/it7-vfs/2-16-upstream-merge/doc'
make[2]: *** [all-recursive] Error 1
make[2]: Leaving directory `/home/martyn/arm-build/it7-vfs/2-16-upstream-merge'
make[1]: *** [all] Error 2
make[1]: Leaving directory `/home/martyn/arm-build/it7-vfs/2-16-upstream-merge'
make: *** [debian/stamp-makefile-build] Error 2
dpkg-buildpackage: This error may be caused by SBOX_DPKG_BUILDDEPS.
dpkg-buildpackage: (See /scrathbox/doc/debian-variables.txt for usage.)
[sbox-garm: ~/arm-build/it7-vfs/2-16-upstream-merge] >