All pastes #218775 Raw Edit

Something

public text v1 · immutable
#218775 ·published 2006-10-24 10:37 UTC
rendered paste body
>>> Source compiled.
>>> Test phase [not enabled]: x11-plugins/gaim-encryption-3.0_beta6

>>> Install gaim-encryption-3.0_beta6 into /var/tmp/portage/x11-plugins/gaim-encryption-3.0_beta6/image/ category x11-plugins
make  install-recursive
make[1]: Entering directory `/var/tmp/portage/x11-plugins/gaim-encryption-3.0_beta6/work/gaim-encryption-3.0beta6'
Making install in po
make[2]: Entering directory `/var/tmp/portage/x11-plugins/gaim-encryption-3.0_beta6/work/gaim-encryption-3.0beta6/po'
/bin/sh `case "@MKINSTALLDIRS@" in /*) echo "@MKINSTALLDIRS@" ;; *) echo "../@MKINSTALLDIRS@" ;; esac` /var/tmp/portage/x11-plugins/gaim-encryption-3.0_beta6/image//usr/share
/bin/sh: ../@MKINSTALLDIRS@: Tiedostoa tai hakemistoa ei ole
make[2]: *** [install-data-yes] Error 127
make[2]: Leaving directory `/var/tmp/portage/x11-plugins/gaim-encryption-3.0_beta6/work/gaim-encryption-3.0beta6/po'
make[1]: *** [install-recursive] Error 1
make[1]: Leaving directory `/var/tmp/portage/x11-plugins/gaim-encryption-3.0_beta6/work/gaim-encryption-3.0beta6'
make: *** [install] Error 2

!!! ERROR: x11-plugins/gaim-encryption-3.0_beta6 failed.
Call stack:
  ebuild.sh, line 1568:   Called dyn_install
  ebuild.sh, line 1022:   Called src_install
  gaim-encryption-3.0_beta6.ebuild, line 33:   Called die

!!! Install failed
!!! If you need support, post the topmost build error, and the call stack if relevant.

vertig0 pygobject # emerge world -NuDav

These are the packages that would be merged, in order:

Calculating world dependencies... done!
[ebuild  N    ] x11-plugins/gaim-encryption-3.0_beta6  USE="nls -debug" 0 kB 

Total size of downloads: 0 kB

Would you like to merge these packages? [Yes/No] no