All pastes #217941 Raw Edit

Stuff

public text v1 · immutable
#217941 ·published 2006-10-23 22:21 UTC
rendered paste body
/home/phanette/RT73_Linux_STA_Drv1.0.3.6/Module/rtmp_main.c:65: warning: (near initialization for 'rtusb_usb_id[10]')
/home/phanette/RT73_Linux_STA_Drv1.0.3.6/Module/rtmp_main.c:65: error: unknown field 'match_flags' specified in initializer
/home/phanette/RT73_Linux_STA_Drv1.0.3.6/Module/rtmp_main.c:65: warning: excess elements in struct initializer
/home/phanette/RT73_Linux_STA_Drv1.0.3.6/Module/rtmp_main.c:65: warning: (near initialization for 'rtusb_usb_id[11]')
/home/phanette/RT73_Linux_STA_Drv1.0.3.6/Module/rtmp_main.c:65: error: unknown field 'idVendor' specified in initializer
/home/phanette/RT73_Linux_STA_Drv1.0.3.6/Module/rtmp_main.c:65: warning: excess elements in struct initializer
/home/phanette/RT73_Linux_STA_Drv1.0.3.6/Module/rtmp_main.c:65: warning: (near initialization for 'rtusb_usb_id[11]')
/home/phanette/RT73_Linux_STA_Drv1.0.3.6/Module/rtmp_main.c:65: error: unknown field 'idProduct' specified in initializer
/home/phanette/RT73_Linux_STA_Drv1.0.3.6/Module/rtmp_main.c:65: warning: excess elements in struct initializer
/home/phanette/RT73_Linux_STA_Drv1.0.3.6/Module/rtmp_main.c:65: warning: (near initialization for 'rtusb_usb_id[11]')
/home/phanette/RT73_Linux_STA_Drv1.0.3.6/Module/rtmp_main.c:65: error: unknown field 'match_flags' specified in initializer
/home/phanette/RT73_Linux_STA_Drv1.0.3.6/Module/rtmp_main.c:65: warning: excess elements in struct initializer
/home/phanette/RT73_Linux_STA_Drv1.0.3.6/Module/rtmp_main.c:65: warning: (near initialization for 'rtusb_usb_id[12]')
/home/phanette/RT73_Linux_STA_Drv1.0.3.6/Module/rtmp_main.c:65: error: unknown field 'idVendor' specified in initializer
/home/phanette/RT73_Linux_STA_Drv1.0.3.6/Module/rtmp_main.c:65: warning: excess elements in struct initializer
/home/phanette/RT73_Linux_STA_Drv1.0.3.6/Module/rtmp_main.c:65: warning: (near initialization for 'rtusb_usb_id[12]')
/home/phanette/RT73_Linux_STA_Drv1.0.3.6/Module/rtmp_main.c:65: error: unknown field 'idProduct' specified in initializer
/home/phanette/RT73_Linux_STA_Drv1.0.3.6/Module/rtmp_main.c:65: warning: excess elements in struct initializer
/home/phanette/RT73_Linux_STA_Drv1.0.3.6/Module/rtmp_main.c:65: warning: (near initialization for 'rtusb_usb_id[12]')
/home/phanette/RT73_Linux_STA_Drv1.0.3.6/Module/rtmp_main.c:65: error: unknown field 'match_flags' specified in initializer
/home/phanette/RT73_Linux_STA_Drv1.0.3.6/Module/rtmp_main.c:65: warning: excess elements in struct initializer
/home/phanette/RT73_Linux_STA_Drv1.0.3.6/Module/rtmp_main.c:65: warning: (near initialization for 'rtusb_usb_id[13]')
/home/phanette/RT73_Linux_STA_Drv1.0.3.6/Module/rtmp_main.c:65: error: unknown field 'idVendor' specified in initializer
/home/phanette/RT73_Linux_STA_Drv1.0.3.6/Module/rtmp_main.c:65: warning: excess elements in struct initializer
/home/phanette/RT73_Linux_STA_Drv1.0.3.6/Module/rtmp_main.c:65: warning: (near initialization for 'rtusb_usb_id[13]')
/home/phanette/RT73_Linux_STA_Drv1.0.3.6/Module/rtmp_main.c:65: error: unknown field 'idProduct' specified in initializer
/home/phanette/RT73_Linux_STA_Drv1.0.3.6/Module/rtmp_main.c:65: warning: excess elements in struct initializer
/home/phanette/RT73_Linux_STA_Drv1.0.3.6/Module/rtmp_main.c:65: warning: (near initialization for 'rtusb_usb_id[13]')
/home/phanette/RT73_Linux_STA_Drv1.0.3.6/Module/rtmp_main.c:65: error: unknown field 'match_flags' specified in initializer
/home/phanette/RT73_Linux_STA_Drv1.0.3.6/Module/rtmp_main.c:65: warning: excess elements in struct initializer
/home/phanette/RT73_Linux_STA_Drv1.0.3.6/Module/rtmp_main.c:65: warning: (near initialization for 'rtusb_usb_id[14]')
/home/phanette/RT73_Linux_STA_Drv1.0.3.6/Module/rtmp_main.c:65: error: unknown field 'idVendor' specified in initializer
/home/phanette/RT73_Linux_STA_Drv1.0.3.6/Module/rtmp_main.c:65: warning: excess elements in struct initializer
/home/phanette/RT73_Linux_STA_Drv1.0.3.6/Module/rtmp_main.c:65: warning: (near initialization for 'rtusb_usb_id[14]')
/home/phanette/RT73_Linux_STA_Drv1.0.3.6/Module/rtmp_main.c:65: error: unknown field 'idProduct' specified in initializer
/home/phanette/RT73_Linux_STA_Drv1.0.3.6/Module/rtmp_main.c:65: warning: excess elements in struct initializer
/home/phanette/RT73_Linux_STA_Drv1.0.3.6/Module/rtmp_main.c:65: warning: (near initialization for 'rtusb_usb_id[14]')
/home/phanette/RT73_Linux_STA_Drv1.0.3.6/Module/rtmp_main.c:65: error: unknown field 'match_flags' specified in initializer
/home/phanette/RT73_Linux_STA_Drv1.0.3.6/Module/rtmp_main.c:65: warning: excess elements in struct initializer
/home/phanette/RT73_Linux_STA_Drv1.0.3.6/Module/rtmp_main.c:65: warning: (near initialization for 'rtusb_usb_id[15]')
/home/phanette/RT73_Linux_STA_Drv1.0.3.6/Module/rtmp_main.c:65: error: unknown field 'idVendor' specified in initializer
/home/phanette/RT73_Linux_STA_Drv1.0.3.6/Module/rtmp_main.c:65: warning: excess elements in struct initializer
/home/phanette/RT73_Linux_STA_Drv1.0.3.6/Module/rtmp_main.c:65: warning: (near initialization for 'rtusb_usb_id[15]')
/home/phanette/RT73_Linux_STA_Drv1.0.3.6/Module/rtmp_main.c:65: error: unknown field 'idProduct' specified in initializer
/home/phanette/RT73_Linux_STA_Drv1.0.3.6/Module/rtmp_main.c:65: warning: excess elements in struct initializer
/home/phanette/RT73_Linux_STA_Drv1.0.3.6/Module/rtmp_main.c:65: warning: (near initialization for 'rtusb_usb_id[15]')
/home/phanette/RT73_Linux_STA_Drv1.0.3.6/Module/rtmp_main.c:65: error: unknown field 'match_flags' specified in initializer
/home/phanette/RT73_Linux_STA_Drv1.0.3.6/Module/rtmp_main.c:65: warning: excess elements in struct initializer
/home/phanette/RT73_Linux_STA_Drv1.0.3.6/Module/rtmp_main.c:65: warning: (near initialization for 'rtusb_usb_id[16]')
/home/phanette/RT73_Linux_STA_Drv1.0.3.6/Module/rtmp_main.c:65: error: unknown field 'idVendor' specified in initializer
/home/phanette/RT73_Linux_STA_Drv1.0.3.6/Module/rtmp_main.c:65: warning: excess elements in struct initializer
/home/phanette/RT73_Linux_STA_Drv1.0.3.6/Module/rtmp_main.c:65: warning: (near initialization for 'rtusb_usb_id[16]')
/home/phanette/RT73_Linux_STA_Drv1.0.3.6/Module/rtmp_main.c:65: error: unknown field 'idProduct' specified in initializer
/home/phanette/RT73_Linux_STA_Drv1.0.3.6/Module/rtmp_main.c:65: warning: excess elements in struct initializer
/home/phanette/RT73_Linux_STA_Drv1.0.3.6/Module/rtmp_main.c:65: warning: (near initialization for 'rtusb_usb_id[16]')
/home/phanette/RT73_Linux_STA_Drv1.0.3.6/Module/rtmp_main.c:65: error: unknown field 'match_flags' specified in initializer
/home/phanette/RT73_Linux_STA_Drv1.0.3.6/Module/rtmp_main.c:65: warning: excess elements in struct initializer
/home/phanette/RT73_Linux_STA_Drv1.0.3.6/Module/rtmp_main.c:65: warning: (near initialization for 'rtusb_usb_id[17]')
/home/phanette/RT73_Linux_STA_Drv1.0.3.6/Module/rtmp_main.c:65: error: unknown field 'idVendor' specified in initializer
/home/phanette/RT73_Linux_STA_Drv1.0.3.6/Module/rtmp_main.c:65: warning: excess elements in struct initializer
/home/phanette/RT73_Linux_STA_Drv1.0.3.6/Module/rtmp_main.c:65: warning: (near initialization for 'rtusb_usb_id[17]')
/home/phanette/RT73_Linux_STA_Drv1.0.3.6/Module/rtmp_main.c:65: error: unknown field 'idProduct' specified in initializer
/home/phanette/RT73_Linux_STA_Drv1.0.3.6/Module/rtmp_main.c:65: warning: excess elements in struct initializer
/home/phanette/RT73_Linux_STA_Drv1.0.3.6/Module/rtmp_main.c:65: warning: (near initialization for 'rtusb_usb_id[17]')
/home/phanette/RT73_Linux_STA_Drv1.0.3.6/Module/rtmp_main.c:65: error: unknown field 'match_flags' specified in initializer
/home/phanette/RT73_Linux_STA_Drv1.0.3.6/Module/rtmp_main.c:65: warning: excess elements in struct initializer
/home/phanette/RT73_Linux_STA_Drv1.0.3.6/Module/rtmp_main.c:65: warning: (near initialization for 'rtusb_usb_id[18]')
/home/phanette/RT73_Linux_STA_Drv1.0.3.6/Module/rtmp_main.c:65: error: unknown field 'idVendor' specified in initializer
/home/phanette/RT73_Linux_STA_Drv1.0.3.6/Module/rtmp_main.c:65: warning: excess elements in struct initializer
/home/phanette/RT73_Linux_STA_Drv1.0.3.6/Module/rtmp_main.c:65: warning: (near initialization for 'rtusb_usb_id[18]')
/home/phanette/RT73_Linux_STA_Drv1.0.3.6/Module/rtmp_main.c:65: error: unknown field 'idProduct' specified in initializer
/home/phanette/RT73_Linux_STA_Drv1.0.3.6/Module/rtmp_main.c:65: warning: excess elements in struct initializer
/home/phanette/RT73_Linux_STA_Drv1.0.3.6/Module/rtmp_main.c:65: warning: (near initialization for 'rtusb_usb_id[18]')
/home/phanette/RT73_Linux_STA_Drv1.0.3.6/Module/rtmp_main.c:66: warning: division by zero
/home/phanette/RT73_Linux_STA_Drv1.0.3.6/Module/rtmp_main.c:66: error: initializer element is not computable at load time
/home/phanette/RT73_Linux_STA_Drv1.0.3.6/Module/rtmp_main.c:80:5: warning: "LINUX_VERSION_CODE" is not defined
/home/phanette/RT73_Linux_STA_Drv1.0.3.6/Module/rtmp_main.c:84: error: expected declaration specifiers or '...' before 'u32'
/home/phanette/RT73_Linux_STA_Drv1.0.3.6/Module/rtmp_main.c:89: warning: initialization from incompatible pointer type
/home/phanette/RT73_Linux_STA_Drv1.0.3.6/Module/rtmp_main.c:90: warning: initialization from incompatible pointer type
/home/phanette/RT73_Linux_STA_Drv1.0.3.6/Module/rtmp_main.c: In function 'rt73_get_ether_stats':
/home/phanette/RT73_Linux_STA_Drv1.0.3.6/Module/rtmp_main.c:125: error: 'struct _RTMP_ADAPTER' has no member named 'stats'
/home/phanette/RT73_Linux_STA_Drv1.0.3.6/Module/rtmp_main.c:125: error: 'struct _RTMP_ADAPTER' has no member named 'WlanCounters'
/home/phanette/RT73_Linux_STA_Drv1.0.3.6/Module/rtmp_main.c:126: error: 'struct _RTMP_ADAPTER' has no member named 'stats'
/home/phanette/RT73_Linux_STA_Drv1.0.3.6/Module/rtmp_main.c:126: error: 'struct _RTMP_ADAPTER' has no member named 'WlanCounters'
/home/phanette/RT73_Linux_STA_Drv1.0.3.6/Module/rtmp_main.c:128: error: 'struct _RTMP_ADAPTER' has no member named 'stats'
/home/phanette/RT73_Linux_STA_Drv1.0.3.6/Module/rtmp_main.c:128: error: 'struct _RTMP_ADAPTER' has no member named 'RalinkCounters'
/home/phanette/RT73_Linux_STA_Drv1.0.3.6/Module/rtmp_main.c:129: error: 'struct _RTMP_ADAPTER' has no member named 'stats'
/home/phanette/RT73_Linux_STA_Drv1.0.3.6/Module/rtmp_main.c:129: error: 'struct _RTMP_ADAPTER' has no member named 'RalinkCounters'
/home/phanette/RT73_Linux_STA_Drv1.0.3.6/Module/rtmp_main.c:131: error: 'struct _RTMP_ADAPTER' has no member named 'stats'
/home/phanette/RT73_Linux_STA_Drv1.0.3.6/Module/rtmp_main.c:131: error: 'struct _RTMP_ADAPTER' has no member named 'Counters8023'
/home/phanette/RT73_Linux_STA_Drv1.0.3.6/Module/rtmp_main.c:132: error: 'struct _RTMP_ADAPTER' has no member named 'stats'
/home/phanette/RT73_Linux_STA_Drv1.0.3.6/Module/rtmp_main.c:132: error: 'struct _RTMP_ADAPTER' has no member named 'Counters8023'
/home/phanette/RT73_Linux_STA_Drv1.0.3.6/Module/rtmp_main.c:134: error: 'struct _RTMP_ADAPTER' has no member named 'stats'
/home/phanette/RT73_Linux_STA_Drv1.0.3.6/Module/rtmp_main.c:134: error: 'struct _RTMP_ADAPTER' has no member named 'Counters8023'
/home/phanette/RT73_Linux_STA_Drv1.0.3.6/Module/rtmp_main.c:135: error: 'struct _RTMP_ADAPTER' has no member named 'stats'
/home/phanette/RT73_Linux_STA_Drv1.0.3.6/Module/rtmp_main.c:135: error: 'struct _RTMP_ADAPTER' has no member named 'WlanCounters'
/home/phanette/RT73_Linux_STA_Drv1.0.3.6/Module/rtmp_main.c:137: error: 'struct _RTMP_ADAPTER' has no member named 'stats'
/home/phanette/RT73_Linux_STA_Drv1.0.3.6/Module/rtmp_main.c:137: error: 'struct _RTMP_ADAPTER' has no member named 'WlanCounters'
/home/phanette/RT73_Linux_STA_Drv1.0.3.6/Module/rtmp_main.c:138: error: 'struct _RTMP_ADAPTER' has no member named 'stats'
/home/phanette/RT73_Linux_STA_Drv1.0.3.6/Module/rtmp_main.c:138: error: 'struct _RTMP_ADAPTER' has no member named 'Counters8023'
/home/phanette/RT73_Linux_STA_Drv1.0.3.6/Module/rtmp_main.c:138: error: 'struct _RTMP_ADAPTER' has no member named 'Counters8023'
/home/phanette/RT73_Linux_STA_Drv1.0.3.6/Module/rtmp_main.c:140: error: 'struct _RTMP_ADAPTER' has no member named 'stats'
/home/phanette/RT73_Linux_STA_Drv1.0.3.6/Module/rtmp_main.c:141: error: 'struct _RTMP_ADAPTER' has no member named 'stats'
/home/phanette/RT73_Linux_STA_Drv1.0.3.6/Module/rtmp_main.c:141: error: 'struct _RTMP_ADAPTER' has no member named 'Counters8023'
/home/phanette/RT73_Linux_STA_Drv1.0.3.6/Module/rtmp_main.c:142: error: 'struct _RTMP_ADAPTER' has no member named 'stats'
/home/phanette/RT73_Linux_STA_Drv1.0.3.6/Module/rtmp_main.c:143: error: 'struct _RTMP_ADAPTER' has no member named 'stats'
/home/phanette/RT73_Linux_STA_Drv1.0.3.6/Module/rtmp_main.c:143: error: 'struct _RTMP_ADAPTER' has no member named 'Counters8023'
/home/phanette/RT73_Linux_STA_Drv1.0.3.6/Module/rtmp_main.c:144: error: 'struct _RTMP_ADAPTER' has no member named 'stats'
/home/phanette/RT73_Linux_STA_Drv1.0.3.6/Module/rtmp_main.c:144: error: 'struct _RTMP_ADAPTER' has no member named 'Counters8023'
/home/phanette/RT73_Linux_STA_Drv1.0.3.6/Module/rtmp_main.c:145: error: 'struct _RTMP_ADAPTER' has no member named 'stats'
/home/phanette/RT73_Linux_STA_Drv1.0.3.6/Module/rtmp_main.c:148: error: 'struct _RTMP_ADAPTER' has no member named 'stats'
/home/phanette/RT73_Linux_STA_Drv1.0.3.6/Module/rtmp_main.c:149: error: 'struct _RTMP_ADAPTER' has no member named 'stats'
/home/phanette/RT73_Linux_STA_Drv1.0.3.6/Module/rtmp_main.c:150: error: 'struct _RTMP_ADAPTER' has no member named 'stats'
/home/phanette/RT73_Linux_STA_Drv1.0.3.6/Module/rtmp_main.c:151: error: 'struct _RTMP_ADAPTER' has no member named 'stats'
/home/phanette/RT73_Linux_STA_Drv1.0.3.6/Module/rtmp_main.c:152: error: 'struct _RTMP_ADAPTER' has no member named 'stats'
/home/phanette/RT73_Linux_STA_Drv1.0.3.6/Module/rtmp_main.c:155: error: 'struct _RTMP_ADAPTER' has no member named 'stats'
/home/phanette/RT73_Linux_STA_Drv1.0.3.6/Module/rtmp_main.c:156: error: 'struct _RTMP_ADAPTER' has no member named 'stats'
/home/phanette/RT73_Linux_STA_Drv1.0.3.6/Module/rtmp_main.c:158: error: 'struct _RTMP_ADAPTER' has no member named 'stats'
/home/phanette/RT73_Linux_STA_Drv1.0.3.6/Module/rtmp_main.c: In function 'rt73_get_wireless_stats':
/home/phanette/RT73_Linux_STA_Drv1.0.3.6/Module/rtmp_main.c:189: error: 'struct _RTMP_ADAPTER' has no member named 'iw_stats'
/home/phanette/RT73_Linux_STA_Drv1.0.3.6/Module/rtmp_main.c:191: error: 'struct _RTMP_ADAPTER' has no member named 'iw_stats'
/home/phanette/RT73_Linux_STA_Drv1.0.3.6/Module/rtmp_main.c:191: error: 'struct _RTMP_ADAPTER' has no member named 'Mlme'
/home/phanette/RT73_Linux_STA_Drv1.0.3.6/Module/rtmp_main.c:195: error: 'struct _RTMP_ADAPTER' has no member named 'iw_stats'
/home/phanette/RT73_Linux_STA_Drv1.0.3.6/Module/rtmp_main.c:195: error: 'struct _RTMP_ADAPTER' has no member named 'PortCfg'
/home/phanette/RT73_Linux_STA_Drv1.0.3.6/Module/rtmp_main.c:197: error: 'struct _RTMP_ADAPTER' has no member named 'iw_stats'
/home/phanette/RT73_Linux_STA_Drv1.0.3.6/Module/rtmp_main.c:197: error: 'struct _RTMP_ADAPTER' has no member named 'BbpRssiToDbmDelta'
/home/phanette/RT73_Linux_STA_Drv1.0.3.6/Module/rtmp_main.c:199: error: 'struct _RTMP_ADAPTER' has no member named 'iw_stats'
/home/phanette/RT73_Linux_STA_Drv1.0.3.6/Module/rtmp_main.c:199: error: 'struct _RTMP_ADAPTER' has no member named 'BbpWriteLatch'
/home/phanette/RT73_Linux_STA_Drv1.0.3.6/Module/rtmp_main.c:199: error: 'struct _RTMP_ADAPTER' has no member named 'BbpTuning'
/home/phanette/RT73_Linux_STA_Drv1.0.3.6/Module/rtmp_main.c:199: error: 'struct _RTMP_ADAPTER' has no member named 'BbpTuning'
/home/phanette/RT73_Linux_STA_Drv1.0.3.6/Module/rtmp_main.c:199: error: 'u32' undeclared (first use in this function)
/home/phanette/RT73_Linux_STA_Drv1.0.3.6/Module/rtmp_main.c:199: error: expected ')' before 'pAd'
/home/phanette/RT73_Linux_STA_Drv1.0.3.6/Module/rtmp_main.c:200: error: 'struct _RTMP_ADAPTER' has no member named 'iw_stats'
/home/phanette/RT73_Linux_STA_Drv1.0.3.6/Module/rtmp_main.c:201: error: 'struct _RTMP_ADAPTER' has no member named 'iw_stats'
/home/phanette/RT73_Linux_STA_Drv1.0.3.6/Module/rtmp_main.c:203: error: 'struct _RTMP_ADAPTER' has no member named 'iw_stats'
/home/phanette/RT73_Linux_STA_Drv1.0.3.6/Module/rtmp_main.c:204: error: 'struct _RTMP_ADAPTER' has no member named 'iw_stats'
/home/phanette/RT73_Linux_STA_Drv1.0.3.6/Module/rtmp_main.c:208: error: 'struct _RTMP_ADAPTER' has no member named 'iw_stats'
/home/phanette/RT73_Linux_STA_Drv1.0.3.6/Module/rtmp_main.c: At top level:
/home/phanette/RT73_Linux_STA_Drv1.0.3.6/Module/rtmp_main.c:214: error: expected declaration specifiers or '...' before 'u8'
/home/phanette/RT73_Linux_STA_Drv1.0.3.6/Module/rtmp_main.c: In function 'RTUSBHalt':
/home/phanette/RT73_Linux_STA_Drv1.0.3.6/Module/rtmp_main.c:226: error: 'struct _RTMP_ADAPTER' has no member named 'Flags'
/home/phanette/RT73_Linux_STA_Drv1.0.3.6/Module/rtmp_main.c:228: error: 'struct _RTMP_ADAPTER' has no member named 'PortCfg'
/home/phanette/RT73_Linux_STA_Drv1.0.3.6/Module/rtmp_main.c:230: error: 'MLME_DISASSOC_REQ_STRUCT' has no member named 'Addr'
/home/phanette/RT73_Linux_STA_Drv1.0.3.6/Module/rtmp_main.c:230: error: 'struct _RTMP_ADAPTER' has no member named 'PortCfg'
/home/phanette/RT73_Linux_STA_Drv1.0.3.6/Module/rtmp_main.c:230: error: too many arguments to function 'memcpy'
/home/phanette/RT73_Linux_STA_Drv1.0.3.6/Module/rtmp_main.c:231: error: 'MLME_DISASSOC_REQ_STRUCT' has no member named 'Reason'
/home/phanette/RT73_Linux_STA_Drv1.0.3.6/Module/rtmp_main.c:233: error: 'MLME_QUEUE_ELEM' has no member named 'Machine'
/home/phanette/RT73_Linux_STA_Drv1.0.3.6/Module/rtmp_main.c:234: error: 'MLME_QUEUE_ELEM' has no member named 'MsgType'
/home/phanette/RT73_Linux_STA_Drv1.0.3.6/Module/rtmp_main.c:235: error: 'MLME_QUEUE_ELEM' has no member named 'MsgLen'
/home/phanette/RT73_Linux_STA_Drv1.0.3.6/Module/rtmp_main.c:236: error: 'MLME_QUEUE_ELEM' has no member named 'Msg'
/home/phanette/RT73_Linux_STA_Drv1.0.3.6/Module/rtmp_main.c:236: error: too many arguments to function 'RTMPMoveMemory'
/home/phanette/RT73_Linux_STA_Drv1.0.3.6/Module/rtmp_main.c:239: warning: implicit declaration of function 'RTMPusecDelay'
/home/phanette/RT73_Linux_STA_Drv1.0.3.6/Module/rtmp_main.c:245: error: too many arguments to function 'RTUSBWriteMACRegister'
/home/phanette/RT73_Linux_STA_Drv1.0.3.6/Module/rtmp_main.c:248: error: too many arguments to function 'RTMPSendNullFrame'
/home/phanette/RT73_Linux_STA_Drv1.0.3.6/Module/rtmp_main.c:254: error: too many arguments to function 'RTMPSetLED'
/home/phanette/RT73_Linux_STA_Drv1.0.3.6/Module/rtmp_main.c:258: error: 'struct _RTMP_ADAPTER' has no member named 'Flags'
/home/phanette/RT73_Linux_STA_Drv1.0.3.6/Module/rtmp_main.c:263: error: 'struct _RTMP_ADAPTER' has no member named 'PortCfg'
/home/phanette/RT73_Linux_STA_Drv1.0.3.6/Module/rtmp_main.c:264: error: 'struct _RTMP_ADAPTER' has no member named 'RxAnt'
/home/phanette/RT73_Linux_STA_Drv1.0.3.6/Module/rtmp_main.c:279: error: 'IsFree' undeclared (first use in this function)
/home/phanette/RT73_Linux_STA_Drv1.0.3.6/Module/rtmp_main.c:279: error: too many arguments to function 'ReleaseAdapter'
/home/phanette/RT73_Linux_STA_Drv1.0.3.6/Module/rtmp_main.c:282: error: 'struct _RTMP_ADAPTER' has no member named 'MLMEThr_pid'
/home/phanette/RT73_Linux_STA_Drv1.0.3.6/Module/rtmp_main.c:283: error: 'struct _RTMP_ADAPTER' has no member named 'RTUSBCmdThr_pid'
/home/phanette/RT73_Linux_STA_Drv1.0.3.6/Module/rtmp_main.c:285: error: 'struct _RTMP_ADAPTER' has no member named 'Flags'
/home/phanette/RT73_Linux_STA_Drv1.0.3.6/Module/rtmp_main.c: In function 'CMDHandler':
/home/phanette/RT73_Linux_STA_Drv1.0.3.6/Module/rtmp_main.c:292: error: 'PUCHAR' undeclared (first use in this function)
/home/phanette/RT73_Linux_STA_Drv1.0.3.6/Module/rtmp_main.c:292: error: expected ';' before 'pData'
/home/phanette/RT73_Linux_STA_Drv1.0.3.6/Module/rtmp_main.c:293: warning: ISO C90 forbids mixed declarations and code
/home/phanette/RT73_Linux_STA_Drv1.0.3.6/Module/rtmp_main.c:294: error: 'u32' undeclared (first use in this function)
/home/phanette/RT73_Linux_STA_Drv1.0.3.6/Module/rtmp_main.c:294: error: expected ';' before 'IrqFlags'
/home/phanette/RT73_Linux_STA_Drv1.0.3.6/Module/rtmp_main.c:295: error: expected ';' before 'Now'
/home/phanette/RT73_Linux_STA_Drv1.0.3.6/Module/rtmp_main.c:297: error: 'struct _RTMP_ADAPTER' has no member named 'CmdQ'
/home/phanette/RT73_Linux_STA_Drv1.0.3.6/Module/rtmp_main.c:300: error: 'IrqFlags' undeclared (first use in this function)
/home/phanette/RT73_Linux_STA_Drv1.0.3.6/Module/rtmp_main.c:300: error: 'struct _RTMP_ADAPTER' has no member named 'CmdQLock'
/home/phanette/RT73_Linux_STA_Drv1.0.3.6/Module/rtmp_main.c:301: error: 'struct _RTMP_ADAPTER' has no member named 'CmdQ'
/home/phanette/RT73_Linux_STA_Drv1.0.3.6/Module/rtmp_main.c:302: error: 'struct _RTMP_ADAPTER' has no member named 'CmdQLock'
/home/phanette/RT73_Linux_STA_Drv1.0.3.6/Module/rtmp_main.c:305: error: 'pData' undeclared (first use in this function)
/home/phanette/RT73_Linux_STA_Drv1.0.3.6/Module/rtmp_main.c:305: error: 'struct _CmdQElmt' has no member named 'buffer'
/home/phanette/RT73_Linux_STA_Drv1.0.3.6/Module/rtmp_main.c:308: error: 'struct _CmdQElmt' has no member named 'command'
/home/phanette/RT73_Linux_STA_Drv1.0.3.6/Module/rtmp_main.c:312: error: expected ';' before 'data'
/home/phanette/RT73_Linux_STA_Drv1.0.3.6/Module/rtmp_main.c:314: error: 'data' undeclared (first use in this function)
/home/phanette/RT73_Linux_STA_Drv1.0.3.6/Module/rtmp_main.c:314: error: too many arguments to function 'RTUSBReadMACRegister'
/home/phanette/RT73_Linux_STA_Drv1.0.3.6/Module/rtmp_main.c:317: error: 'struct _RTMP_ADAPTER' has no member named 'PortCfg'
/home/phanette/RT73_Linux_STA_Drv1.0.3.6/Module/rtmp_main.c:321: error: 'struct _RTMP_ADAPTER' has no member named 'PortCfg'
/home/phanette/RT73_Linux_STA_Drv1.0.3.6/Module/rtmp_main.c:323: error: 'struct _RTMP_ADAPTER' has no member named 'PortCfg'
/home/phanette/RT73_Linux_STA_Drv1.0.3.6/Module/rtmp_main.c:323: error: 'struct _RTMP_ADAPTER' has no member named 'PortCfg'
/home/phanette/RT73_Linux_STA_Drv1.0.3.6/Module/rtmp_main.c:323: error: 'struct _RTMP_ADAPTER' has no member named 'PortCfg'
/home/phanette/RT73_Linux_STA_Drv1.0.3.6/Module/rtmp_main.c:325: error: 'struct _RTMP_ADAPTER' has no member named 'PortCfg'
/home/phanette/RT73_Linux_STA_Drv1.0.3.6/Module/rtmp_main.c:325: error: 'struct _RTMP_ADAPTER' has no member named 'PortCfg'
/home/phanette/RT73_Linux_STA_Drv1.0.3.6/Module/rtmp_main.c:325: error: 'struct _RTMP_ADAPTER' has no member named 'PortCfg'
/home/phanette/RT73_Linux_STA_Drv1.0.3.6/Module/rtmp_main.c:326: error: 'struct _RTMP_ADAPTER' has no member named 'PortCfg'
/home/phanette/RT73_Linux_STA_Drv1.0.3.6/Module/rtmp_main.c:330: error: 'struct _RTMP_ADAPTER' has no member named 'ExtraInfo'
/home/phanette/RT73_Linux_STA_Drv1.0.3.6/Module/rtmp_main.c:336: error: 'struct _RTMP_ADAPTER' has no member named 'ExtraInfo'
/home/phanette/RT73_Linux_STA_Drv1.0.3.6/Module/rtmp_main.c:348: error: 'struct _RTMP_ADAPTER' has no member named 'Mlme'
/home/phanette/RT73_Linux_STA_Drv1.0.3.6/Module/rtmp_main.c:350: warning: implicit declaration of function 'MlmeEnqueue'
/home/phanette/RT73_Linux_STA_Drv1.0.3.6/Module/rtmp_main.c:358: error: 'Now' undeclared (first use in this function)
/home/phanette/RT73_Linux_STA_Drv1.0.3.6/Module/rtmp_main.c:359: error: 'struct _RTMP_ADAPTER' has no member named 'MlmeAux'
/home/phanette/RT73_Linux_STA_Drv1.0.3.6/Module/rtmp_main.c:361: error: 'struct _RTMP_ADAPTER' has no member named 'PortCfg'
/home/phanette/RT73_Linux_STA_Drv1.0.3.6/Module/rtmp_main.c:362: error: 'struct _RTMP_ADAPTER' has no member named 'PortCfg'
/home/phanette/RT73_Linux_STA_Drv1.0.3.6/Module/rtmp_main.c:368: error: 'struct _RTMP_ADAPTER' has no member named 'MLMEThr_pid'
/home/phanette/RT73_Linux_STA_Drv1.0.3.6/Module/rtmp_main.c:368: warning: implicit declaration of function 'up'
/home/phanette/RT73_Linux_STA_Drv1.0.3.6/Module/rtmp_main.c:375: error: 'struct _RTMP_ADAPTER' has no member named 'Mlme'
/home/phanette/RT73_Linux_STA_Drv1.0.3.6/Module/rtmp_main.c:385: error: 'struct _RTMP_ADAPTER' has no member named 'MlmeAux'
/home/phanette/RT73_Linux_STA_Drv1.0.3.6/Module/rtmp_main.c:388: error: 'struct _RTMP_ADAPTER' has no member named 'PortCfg'
/home/phanette/RT73_Linux_STA_Drv1.0.3.6/Module/rtmp_main.c:393: error: 'struct _CmdQElmt' has no member named 'bufferlength'
/home/phanette/RT73_Linux_STA_Drv1.0.3.6/Module/rtmp_main.c:394: error: 'struct _CmdQElmt' has no member named 'buffer'
/home/phanette/RT73_Linux_STA_Drv1.0.3.6/Module/rtmp_main.c:395: error: 'struct _RTMP_ADAPTER' has no member named 'MLMEThr_pid'
/home/phanette/RT73_Linux_STA_Drv1.0.3.6/Module/rtmp_main.c:401: error: 'struct _RTMP_ADAPTER' has no member named 'Mlme'
/home/phanette/RT73_Linux_STA_Drv1.0.3.6/Module/rtmp_main.c:411: error: 'struct _RTMP_ADAPTER' has no member named 'MlmeAux'
/home/phanette/RT73_Linux_STA_Drv1.0.3.6/Module/rtmp_main.c:414: error: 'struct _RTMP_ADAPTER' has no member named 'PortCfg'
/home/phanette/RT73_Linux_STA_Drv1.0.3.6/Module/rtmp_main.c:415: error: 'struct _RTMP_ADAPTER' has no member named 'bConfigChanged'
/home/phanette/RT73_Linux_STA_Drv1.0.3.6/Module/rtmp_main.c:420: error: 'struct _CmdQElmt' has no member named 'bufferlength'
/home/phanette/RT73_Linux_STA_Drv1.0.3.6/Module/rtmp_main.c:422: error: 'struct _RTMP_ADAPTER' has no member named 'MLMEThr_pid'
/home/phanette/RT73_Linux_STA_Drv1.0.3.6/Module/rtmp_main.c:428: error: 'struct _RTMP_ADAPTER' has no member named 'Mlme'
/home/phanette/RT73_Linux_STA_Drv1.0.3.6/Module/rtmp_main.c:439: error: 'struct _RTMP_ADAPTER' has no member named 'MlmeAux'
/home/phanette/RT73_Linux_STA_Drv1.0.3.6/Module/rtmp_main.c:446: error: 'struct _RTMP_ADAPTER' has no member named 'MLMEThr_pid'
/home/phanette/RT73_Linux_STA_Drv1.0.3.6/Module/rtmp_main.c:453: error: 'NDIS_802_11_ANTENNA' undeclared (first use in this function)
/home/phanette/RT73_Linux_STA_Drv1.0.3.6/Module/rtmp_main.c:453: error: expected ';' before 'Antenna'
/home/phanette/RT73_Linux_STA_Drv1.0.3.6/Module/rtmp_main.c:455: error: 'Antenna' undeclared (first use in this function)
/home/phanette/RT73_Linux_STA_Drv1.0.3.6/Module/rtmp_main.c:456: error: 'struct _RTMP_ADAPTER' has no member named 'Antenna'
/home/phanette/RT73_Linux_STA_Drv1.0.3.6/Module/rtmp_main.c:458: error: 'struct _RTMP_ADAPTER' has no member named 'Antenna'
/home/phanette/RT73_Linux_STA_Drv1.0.3.6/Module/rtmp_main.c:460: error: 'struct _RTMP_ADAPTER' has no member named 'Antenna'
/home/phanette/RT73_Linux_STA_Drv1.0.3.6/Module/rtmp_main.c:462: error: 'struct _RTMP_ADAPTER' has no member named 'PortCfg'
/home/phanette/RT73_Linux_STA_Drv1.0.3.6/Module/rtmp_main.c:463: error: 'struct _RTMP_ADAPTER' has no member named 'LatchRfRegs'
/home/phanette/RT73_Linux_STA_Drv1.0.3.6/Module/rtmp_main.c:463: error: too many arguments to function 'AsicAntennaSelect'
/home/phanette/RT73_Linux_STA_Drv1.0.3.6/Module/rtmp_main.c:470: error: expected ';' before 'Antenna'
/home/phanette/RT73_Linux_STA_Drv1.0.3.6/Module/rtmp_main.c:473: error: 'struct _RTMP_ADAPTER' has no member named 'Antenna'
/home/phanette/RT73_Linux_STA_Drv1.0.3.6/Module/rtmp_main.c:475: error: 'struct _RTMP_ADAPTER' has no member named 'Antenna'
/home/phanette/RT73_Linux_STA_Drv1.0.3.6/Module/rtmp_main.c:477: error: 'struct _RTMP_ADAPTER' has no member named 'Antenna'
/home/phanette/RT73_Linux_STA_Drv1.0.3.6/Module/rtmp_main.c:479: error: 'struct _RTMP_ADAPTER' has no member named 'PortCfg'
/home/phanette/RT73_Linux_STA_Drv1.0.3.6/Module/rtmp_main.c:480: error: 'struct _RTMP_ADAPTER' has no member named 'LatchRfRegs'
/home/phanette/RT73_Linux_STA_Drv1.0.3.6/Module/rtmp_main.c:480: error: too many arguments to function 'AsicAntennaSelect'
/home/phanette/RT73_Linux_STA_Drv1.0.3.6/Module/rtmp_main.c:495: error: 'u16' undeclared (first use in this function)
/home/phanette/RT73_Linux_STA_Drv1.0.3.6/Module/rtmp_main.c:495: error: expected ';' before 'Offset'
/home/phanette/RT73_Linux_STA_Drv1.0.3.6/Module/rtmp_main.c:496: error: expected ';' before 'Length'
/home/phanette/RT73_Linux_STA_Drv1.0.3.6/Module/rtmp_main.c:497: error: 'Offset' undeclared (first use in this function)
/home/phanette/RT73_Linux_STA_Drv1.0.3.6/Module/rtmp_main.c:497: error: 'Length' undeclared (first use in this function)
/home/phanette/RT73_Linux_STA_Drv1.0.3.6/Module/rtmp_main.c:497: error: too many arguments to function 'RTUSBMultiRead'
/home/phanette/RT73_Linux_STA_Drv1.0.3.6/Module/rtmp_main.c:503: error: expected ';' before 'Offset'
/home/phanette/RT73_Linux_STA_Drv1.0.3.6/Module/rtmp_main.c:504: error: expected ';' before 'Length'
/home/phanette/RT73_Linux_STA_Drv1.0.3.6/Module/rtmp_main.c:505: error: too many arguments to function 'RTUSBMultiWrite'
/home/phanette/RT73_Linux_STA_Drv1.0.3.6/Module/rtmp_main.c:511: error: expected ';' before 'Offset'
/home/phanette/RT73_Linux_STA_Drv1.0.3.6/Module/rtmp_main.c:512: error: expected ';' before 'Length'
/home/phanette/RT73_Linux_STA_Drv1.0.3.6/Module/rtmp_main.c:513: error: too many arguments to function 'RTUSBReadEEPROM'
/home/phanette/RT73_Linux_STA_Drv1.0.3.6/Module/rtmp_main.c:519: error: expected ';' before 'Offset'
/home/phanette/RT73_Linux_STA_Drv1.0.3.6/Module/rtmp_main.c:524: error: expected ';' before 'Residual'
/home/phanette/RT73_Linux_STA_Drv1.0.3.6/Module/rtmp_main.c:526: error: 'Residual' undeclared (first use in this function)
/home/phanette/RT73_Linux_STA_Drv1.0.3.6/Module/rtmp_main.c:528: error: too many arguments to function 'RTUSBWriteEEPROM'
/home/phanette/RT73_Linux_STA_Drv1.0.3.6/Module/rtmp_main.c:533: error: too many arguments to function 'RTUSBWriteEEPROM'
/home/phanette/RT73_Linux_STA_Drv1.0.3.6/Module/rtmp_main.c:546: error: too many arguments to function 'RTUSB_VendorRequest'
/home/phanette/RT73_Linux_STA_Drv1.0.3.6/Module/rtmp_main.c:557: error: too many arguments to function 'RTUSB_VendorRequest'
/home/phanette/RT73_Linux_STA_Drv1.0.3.6/Module/rtmp_main.c:565: error: 'struct _RTMP_ADAPTER' has no member named 'Flags'
/home/phanette/RT73_Linux_STA_Drv1.0.3.6/Module/rtmp_main.c:572: error: too many arguments to function 'ReleaseAdapter'
/home/phanette/RT73_Linux_STA_Drv1.0.3.6/Module/rtmp_main.c:575: error: 'struct _RTMP_ADAPTER' has no member named 'Flags'
/home/phanette/RT73_Linux_STA_Drv1.0.3.6/Module/rtmp_main.c:577: error: 'struct _RTMP_ADAPTER' has no member named 'Flags'
/home/phanette/RT73_Linux_STA_Drv1.0.3.6/Module/rtmp_main.c:579: error: 'struct _RTMP_ADAPTER' has no member named 'Flags'
/home/phanette/RT73_Linux_STA_Drv1.0.3.6/Module/rtmp_main.c:582: error: 'struct _RTMP_ADAPTER' has no member named 'Flags'
/home/phanette/RT73_Linux_STA_Drv1.0.3.6/Module/rtmp_main.c:586: error: 'struct _RTMP_ADAPTER' has no member named 'SendTxWaitQueue'
/home/phanette/RT73_Linux_STA_Drv1.0.3.6/Module/rtmp_main.c:588: error: too many arguments to function 'RTMPDeQueuePacket'
/home/phanette/RT73_Linux_STA_Drv1.0.3.6/Module/rtmp_main.c:602: error: 'struct _RTMP_ADAPTER' has no member named 'Flags'
/home/phanette/RT73_Linux_STA_Drv1.0.3.6/Module/rtmp_main.c:607: error: 'struct _RTMP_ADAPTER' has no member named 'RxContext'
/home/phanette/RT73_Linux_STA_Drv1.0.3.6/Module/rtmp_main.c:609: error: 'struct _RX_CONTEXT' has no member named 'pUrb'
/home/phanette/RT73_Linux_STA_Drv1.0.3.6/Module/rtmp_main.c:611: error: 'struct _RX_CONTEXT' has no member named 'pUrb'
/home/phanette/RT73_Linux_STA_Drv1.0.3.6/Module/rtmp_main.c:612: error: 'struct _RX_CONTEXT' has no member named 'pUrb'
/home/phanette/RT73_Linux_STA_Drv1.0.3.6/Module/rtmp_main.c:613: error: 'struct _RX_CONTEXT' has no member named 'pUrb'
/home/phanette/RT73_Linux_STA_Drv1.0.3.6/Module/rtmp_main.c:615: error: 'struct _RX_CONTEXT' has no member named 'TransferBuffer'
/home/phanette/RT73_Linux_STA_Drv1.0.3.6/Module/rtmp_main.c:617: error: 'struct _RX_CONTEXT' has no member named 'TransferBuffer'
/home/phanette/RT73_Linux_STA_Drv1.0.3.6/Module/rtmp_main.c:618: error: 'struct _RX_CONTEXT' has no member named 'TransferBuffer'
/home/phanette/RT73_Linux_STA_Drv1.0.3.6/Module/rtmp_main.c:622: error: 'struct _RTMP_ADAPTER' has no member named 'Flags'
/home/phanette/RT73_Linux_STA_Drv1.0.3.6/Module/rtmp_main.c:623: error: 'struct _RTMP_ADAPTER' has no member named 'Flags'
/home/phanette/RT73_Linux_STA_Drv1.0.3.6/Module/rtmp_main.c:625: error: 'struct _RTMP_ADAPTER' has no member named 'Flags'
/home/phanette/RT73_Linux_STA_Drv1.0.3.6/Module/rtmp_main.c:628: error: 'struct _RTMP_ADAPTER' has no member named 'Flags'
/home/phanette/RT73_Linux_STA_Drv1.0.3.6/Module/rtmp_main.c:631: error: too many arguments to function 'RTUSBWriteMACRegister'
/home/phanette/RT73_Linux_STA_Drv1.0.3.6/Module/rtmp_main.c:639: error: 'RT_802_11_STA_CONFIG' has no member named 'EnableTxBurst'
/home/phanette/RT73_Linux_STA_Drv1.0.3.6/Module/rtmp_main.c:639: error: 'struct _RTMP_ADAPTER' has no member named 'PortCfg'
/home/phanette/RT73_Linux_STA_Drv1.0.3.6/Module/rtmp_main.c:641: error: 'struct _RTMP_ADAPTER' has no member named 'PortCfg'
/home/phanette/RT73_Linux_STA_Drv1.0.3.6/Module/rtmp_main.c:641: error: 'RT_802_11_STA_CONFIG' has no member named 'EnableTxBurst'
/home/phanette/RT73_Linux_STA_Drv1.0.3.6/Module/rtmp_main.c:643: error: 'struct _RTMP_ADAPTER' has no member named 'PortCfg'
/home/phanette/RT73_Linux_STA_Drv1.0.3.6/Module/rtmp_main.c:645: error: 'struct _RTMP_ADAPTER' has no member named 'PortCfg'
/home/phanette/RT73_Linux_STA_Drv1.0.3.6/Module/rtmp_main.c:648: error: 'struct _RTMP_ADAPTER' has no member named 'PortCfg'
/home/phanette/RT73_Linux_STA_Drv1.0.3.6/Module/rtmp_main.c:657: error: 'struct _RTMP_ADAPTER' has no member named 'PortCfg'
/home/phanette/RT73_Linux_STA_Drv1.0.3.6/Module/rtmp_main.c:658: error: 'u8' undeclared (first use in this function)
/home/phanette/RT73_Linux_STA_Drv1.0.3.6/Module/rtmp_main.c:658: error: expected ')' before 'pAd'
/home/phanette/RT73_Linux_STA_Drv1.0.3.6/Module/rtmp_main.c:658: error: too many arguments to function 'AsicSetSlotTime'
/home/phanette/RT73_Linux_STA_Drv1.0.3.6/Module/rtmp_main.c:664: error: 'struct _RTMP_ADAPTER' has no member named 'PortCfg'
/home/phanette/RT73_Linux_STA_Drv1.0.3.6/Module/rtmp_main.c:664: error: 'RT_802_11_STA_CONFIG' has no member named 'UseBGProtection'
/home/phanette/RT73_Linux_STA_Drv1.0.3.6/Module/rtmp_main.c:666: error: 'struct _RTMP_ADAPTER' has no member named 'PortCfg'
/home/phanette/RT73_Linux_STA_Drv1.0.3.6/Module/rtmp_main.c:667: error: 'struct _RTMP_ADAPTER' has no member named 'PortCfg'
/home/phanette/RT73_Linux_STA_Drv1.0.3.6/Module/rtmp_main.c:667: error: 'RT_802_11_STA_CONFIG' has no member named 'AdhocMode'
/home/phanette/RT73_Linux_STA_Drv1.0.3.6/Module/rtmp_main.c:671: error: 'struct _RTMP_ADAPTER' has no member named 'PortCfg'
/home/phanette/RT73_Linux_STA_Drv1.0.3.6/Module/rtmp_main.c:671: error: 'RT_802_11_STA_CONFIG' has no member named 'AdhocMode'
/home/phanette/RT73_Linux_STA_Drv1.0.3.6/Module/rtmp_main.c:672: error: 'struct _RTMP_ADAPTER' has no member named 'PortCfg'
/home/phanette/RT73_Linux_STA_Drv1.0.3.6/Module/rtmp_main.c:674: error: too many arguments to function 'MlmeUpdateTxRates'
/home/phanette/RT73_Linux_STA_Drv1.0.3.6/Module/rtmp_main.c:675: warning: implicit declaration of function 'MakeIbssBeacon'
/home/phanette/RT73_Linux_STA_Drv1.0.3.6/Module/rtmp_main.c:689: error: too many arguments to function 'MlmeSetPsmBit'
/home/phanette/RT73_Linux_STA_Drv1.0.3.6/Module/rtmp_main.c:690: error: 'struct _RTMP_ADAPTER' has no member named 'PortCfg'
/home/phanette/RT73_Linux_STA_Drv1.0.3.6/Module/rtmp_main.c:690: error: too many arguments to function 'RTMPSendNullFrame'
/home/phanette/RT73_Linux_STA_Drv1.0.3.6/Module/rtmp_main.c:694: error: 'struct _RTMP_ADAPTER' has no member named 'PortCfg'
/home/phanette/RT73_Linux_STA_Drv1.0.3.6/Module/rtmp_main.c:698: error: 'struct _RTMP_ADAPTER' has no member named 'ExtraInfo'
/home/phanette/RT73_Linux_STA_Drv1.0.3.6/Module/rtmp_main.c:704: error: 'struct _RTMP_ADAPTER' has no member named 'ExtraInfo'
/home/phanette/RT73_Linux_STA_Drv1.0.3.6/Module/rtmp_main.c:711: error: expected ';' before 'i'
/home/phanette/RT73_Linux_STA_Drv1.0.3.6/Module/rtmp_main.c:715: error: too many arguments to function 'MlmeSuspend'
/home/phanette/RT73_Linux_STA_Drv1.0.3.6/Module/rtmp_main.c:719: error: too many arguments to function 'RTUSBWriteMACRegister'
/home/phanette/RT73_Linux_STA_Drv1.0.3.6/Module/rtmp_main.c:721: error: 'struct _RTMP_ADAPTER' has no member named 'PendingRx'
/home/phanette/RT73_Linux_STA_Drv1.0.3.6/Module/rtmp_main.c:722: error: 'struct _RTMP_ADAPTER' has no member named 'BulkOutPending'
/home/phanette/RT73_Linux_STA_Drv1.0.3.6/Module/rtmp_main.c:723: error: 'struct _RTMP_ADAPTER' has no member named 'BulkOutPending'
/home/phanette/RT73_Linux_STA_Drv1.0.3.6/Module/rtmp_main.c:724: error: 'struct _RTMP_ADAPTER' has no member named 'BulkOutPending'
/home/phanette/RT73_Linux_STA_Drv1.0.3.6/Module/rtmp_main.c:725: error: 'struct _RTMP_ADAPTER' has no member named 'BulkOutPending'
/home/phanette/RT73_Linux_STA_Drv1.0.3.6/Module/rtmp_main.c:728: error: 'struct _RTMP_ADAPTER' has no member named 'PendingRx'
/home/phanette/RT73_Linux_STA_Drv1.0.3.6/Module/rtmp_main.c:738: error: too many arguments to function 'RTUSB_VendorRequest'
/home/phanette/RT73_Linux_STA_Drv1.0.3.6/Module/rtmp_main.c:741: error: 'struct _RTMP_ADAPTER' has no member named 'BulkOutPending'
/home/phanette/RT73_Linux_STA_Drv1.0.3.6/Module/rtmp_main.c:742: error: 'struct _RTMP_ADAPTER' has no member named 'BulkOutPending'
/home/phanette/RT73_Linux_STA_Drv1.0.3.6/Module/rtmp_main.c:743: error: 'struct _RTMP_ADAPTER' has no member named 'BulkOutPending'
/home/phanette/RT73_Linux_STA_Drv1.0.3.6/Module/rtmp_main.c:744: error: 'struct _RTMP_ADAPTER' has no member named 'BulkOutPending'
/home/phanette/RT73_Linux_STA_Drv1.0.3.6/Module/rtmp_main.c:747: error: 'i' undeclared (first use in this function)
/home/phanette/RT73_Linux_STA_Drv1.0.3.6/Module/rtmp_main.c:758: error: 'struct _RTMP_ADAPTER' has no member named 'Flags'
/home/phanette/RT73_Linux_STA_Drv1.0.3.6/Module/rtmp_main.c:760: error: 'struct _RTMP_ADAPTER' has no member named 'Flags'
/home/phanette/RT73_Linux_STA_Drv1.0.3.6/Module/rtmp_main.c:762: error: 'struct _RTMP_ADAPTER' has no member named 'Flags'
/home/phanette/RT73_Linux_STA_Drv1.0.3.6/Module/rtmp_main.c:764: error: 'struct _RTMP_ADAPTER' has no member named 'Flags'
/home/phanette/RT73_Linux_STA_Drv1.0.3.6/Module/rtmp_main.c:766: error: 'struct _RTMP_ADAPTER' has no member named 'Flags'
/home/phanette/RT73_Linux_STA_Drv1.0.3.6/Module/rtmp_main.c:768: error: 'struct _RTMP_ADAPTER' has no member named 'Flags'
/home/phanette/RT73_Linux_STA_Drv1.0.3.6/Module/rtmp_main.c:771: error: 'struct _RTMP_ADAPTER' has no member named 'Flags'
/home/phanette/RT73_Linux_STA_Drv1.0.3.6/Module/rtmp_main.c:773: error: 'struct _RTMP_ADAPTER' has no member named 'Flags'
/home/phanette/RT73_Linux_STA_Drv1.0.3.6/Module/rtmp_main.c:774: error: 'struct _RTMP_ADAPTER' has no member named 'Flags'
/home/phanette/RT73_Linux_STA_Drv1.0.3.6/Module/rtmp_main.c:775: error: 'struct _RTMP_ADAPTER' has no member named 'Flags'
/home/phanette/RT73_Linux_STA_Drv1.0.3.6/Module/rtmp_main.c:779: error: too many arguments to function 'RTUSBWriteMACRegister'
/home/phanette/RT73_Linux_STA_Drv1.0.3.6/Module/rtmp_main.c:786: error: too many arguments to function 'LinkDown'
/home/phanette/RT73_Linux_STA_Drv1.0.3.6/Module/rtmp_main.c:791: error: expected ';' before 'Offset'
/home/phanette/RT73_Linux_STA_Drv1.0.3.6/Module/rtmp_main.c:792: error: expected ')' before 'pData'
/home/phanette/RT73_Linux_STA_Drv1.0.3.6/Module/rtmp_main.c:793: error: 'Value' undeclared (first use in this function)
/home/phanette/RT73_Linux_STA_Drv1.0.3.6/Module/rtmp_main.c:795: error: too many arguments to function 'RTUSBWriteBBPRegister'
/home/phanette/RT73_Linux_STA_Drv1.0.3.6/Module/rtmp_main.c:801: error: expected ';' before 'Offset'
/home/phanette/RT73_Linux_STA_Drv1.0.3.6/Module/rtmp_main.c:802: error: expected ';' before 'pValue'
/home/phanette/RT73_Linux_STA_Drv1.0.3.6/Module/rtmp_main.c:805: error: 'pValue' undeclared (first use in this function)
/home/phanette/RT73_Linux_STA_Drv1.0.3.6/Module/rtmp_main.c:805: error: too many arguments to function 'RTUSBReadBBPRegister'
/home/phanette/RT73_Linux_STA_Drv1.0.3.6/Module/rtmp_main.c:812: error: expected ';' before 'Value'
/home/phanette/RT73_Linux_STA_Drv1.0.3.6/Module/rtmp_main.c:815: error: too many arguments to function 'RTUSBWriteRFRegister'
/home/phanette/RT73_Linux_STA_Drv1.0.3.6/Module/rtmp_main.c:821: error: expected ';' before 'Value'
/home/phanette/RT73_Linux_STA_Drv1.0.3.6/Module/rtmp_main.c:823: error: too many arguments to function 'RTUSBMultiRead'
/home/phanette/RT73_Linux_STA_Drv1.0.3.6/Module/rtmp_main.c:835: error: too many arguments to function 'RTUSB_VendorRequest'
/home/phanette/RT73_Linux_STA_Drv1.0.3.6/Module/rtmp_main.c:846: error: too many arguments to function 'RTUSB_VendorRequest'
/home/phanette/RT73_Linux_STA_Drv1.0.3.6/Module/rtmp_main.c:867: error: expected ';' before 'Value1'
/home/phanette/RT73_Linux_STA_Drv1.0.3.6/Module/rtmp_main.c:868: error: 'Value1' undeclared (first use in this function)
/home/phanette/RT73_Linux_STA_Drv1.0.3.6/Module/rtmp_main.c:868: error: too many arguments to function 'RTUSBReadMACRegister'
/home/phanette/RT73_Linux_STA_Drv1.0.3.6/Module/rtmp_main.c:869: error: 'Value2' undeclared (first use in this function)
/home/phanette/RT73_Linux_STA_Drv1.0.3.6/Module/rtmp_main.c:869: error: too many arguments to function 'RTUSBReadMACRegister'
/home/phanette/RT73_Linux_STA_Drv1.0.3.6/Module/rtmp_main.c:882: error: too many arguments to function 'RTUSBWriteMACRegister'
/home/phanette/RT73_Linux_STA_Drv1.0.3.6/Module/rtmp_main.c:883: error: too many arguments to function 'RTUSBWriteMACRegister'
/home/phanette/RT73_Linux_STA_Drv1.0.3.6/Module/rtmp_main.c:888: error: too many arguments to function 'MlmeUpdateTxRates'
/home/phanette/RT73_Linux_STA_Drv1.0.3.6/Module/rtmp_main.c:889: error: 'struct _RTMP_ADAPTER' has no member named 'PortCfg'
/home/phanette/RT73_Linux_STA_Drv1.0.3.6/Module/rtmp_main.c:895: error: expected ';' before 'Preamble'
/home/phanette/RT73_Linux_STA_Drv1.0.3.6/Module/rtmp_main.c:896: error: 'Preamble' undeclared (first use in this function)
/home/phanette/RT73_Linux_STA_Drv1.0.3.6/Module/rtmp_main.c:898: error: 'struct _RTMP_ADAPTER' has no member named 'PortCfg'
/home/phanette/RT73_Linux_STA_Drv1.0.3.6/Module/rtmp_main.c:899: error: too many arguments to function 'MlmeSetTxPreamble'
/home/phanette/RT73_Linux_STA_Drv1.0.3.6/Module/rtmp_main.c:905: error: 'struct _RTMP_ADAPTER' has no member named 'PortCfg'
/home/phanette/RT73_Linux_STA_Drv1.0.3.6/Module/rtmp_main.c:906: error: too many arguments to function 'MlmeSetTxPreamble'
/home/phanette/RT73_Linux_STA_Drv1.0.3.6/Module/rtmp_main.c:915: error: 'struct _CmdQElmt' has no member named 'buffer'
/home/phanette/RT73_Linux_STA_Drv1.0.3.6/Module/rtmp_main.c:917: error: too many arguments to function 'RTMPSetPhyMode'
/home/phanette/RT73_Linux_STA_Drv1.0.3.6/Module/rtmp_main.c:919: error: too many arguments to function 'RTMPSetPhyMode'
/home/phanette/RT73_Linux_STA_Drv1.0.3.6/Module/rtmp_main.c:921: error: too many arguments to function 'RTMPSetPhyMode'
/home/phanette/RT73_Linux_STA_Drv1.0.3.6/Module/rtmp_main.c:930: error: expected ';' before 'phymode'
/home/phanette/RT73_Linux_STA_Drv1.0.3.6/Module/rtmp_main.c:931: error: 'phymode' undeclared (first use in this function)
/home/phanette/RT73_Linux_STA_Drv1.0.3.6/Module/rtmp_main.c:931: error: too many arguments to function 'RTMPSetPhyMode'
/home/phanette/RT73_Linux_STA_Drv1.0.3.6/Module/rtmp_main.c:1022: error: expected ';' before 'KeyIdx'
/home/phanette/RT73_Linux_STA_Drv1.0.3.6/Module/rtmp_main.c:1023: warning: ISO C90 forbids mixed declarations and code
/home/phanette/RT73_Linux_STA_Drv1.0.3.6/Module/rtmp_main.c:1028: error: 'KeyIdx' undeclared (first use in this function)
/home/phanette/RT73_Linux_STA_Drv1.0.3.6/Module/rtmp_main.c:1028: error: 'struct _NDIS_802_11_WEP' has no member named 'KeyIndex'
/home/phanette/RT73_Linux_STA_Drv1.0.3.6/Module/rtmp_main.c:1031: error: 'struct _NDIS_802_11_WEP' has no member named 'KeyLength'
/home/phanette/RT73_Linux_STA_Drv1.0.3.6/Module/rtmp_main.c:1031: error: 'struct _NDIS_802_11_WEP' has no member named 'KeyLength'
/home/phanette/RT73_Linux_STA_Drv1.0.3.6/Module/rtmp_main.c:1038: error: expected ';' before 'CipherAlg'
/home/phanette/RT73_Linux_STA_Drv1.0.3.6/Module/rtmp_main.c:1039: error: 'struct _RTMP_ADAPTER' has no member named 'SharedKey'
/home/phanette/RT73_Linux_STA_Drv1.0.3.6/Module/rtmp_main.c:1039: error: expected ';' before 'pWepKey'
/home/phanette/RT73_Linux_STA_Drv1.0.3.6/Module/rtmp_main.c:1040: error: 'struct _RTMP_ADAPTER' has no member named 'SharedKey'
/home/phanette/RT73_Linux_STA_Drv1.0.3.6/Module/rtmp_main.c:1040: error: 'struct _NDIS_802_11_WEP' has no member named 'KeyMaterial'
/home/phanette/RT73_Linux_STA_Drv1.0.3.6/Module/rtmp_main.c:1040: error: 'struct _NDIS_802_11_WEP' has no member named 'KeyLength'
/home/phanette/RT73_Linux_STA_Drv1.0.3.6/Module/rtmp_main.c:1040: error: too many arguments to function 'RTMPMoveMemory'
/home/phanette/RT73_Linux_STA_Drv1.0.3.6/Module/rtmp_main.c:1041: error: 'CipherAlg' undeclared (first use in this function)
/home/phanette/RT73_Linux_STA_Drv1.0.3.6/Module/rtmp_main.c:1041: error: 'struct _RTMP_ADAPTER' has no member named 'SharedKey'
/home/phanette/RT73_Linux_STA_Drv1.0.3.6/Module/rtmp_main.c:1042: error: 'struct _RTMP_ADAPTER' has no member named 'SharedKey'
/home/phanette/RT73_Linux_STA_Drv1.0.3.6/Module/rtmp_main.c:1043: error: 'struct _NDIS_802_11_WEP' has no member named 'KeyIndex'
/home/phanette/RT73_Linux_STA_Drv1.0.3.6/Module/rtmp_main.c:1046: error: 'struct _RTMP_ADAPTER' has no member named 'PortCfg'
/home/phanette/RT73_Linux_STA_Drv1.0.3.6/Module/rtmp_main.c:1046: error: expected ';' before 'KeyIdx'
/home/phanette/RT73_Linux_STA_Drv1.0.3.6/Module/rtmp_main.c:1048: error: expected ')' before 'KeyIdx'
/home/phanette/RT73_Linux_STA_Drv1.0.3.6/Module/rtmp_main.c:1048: error: too many arguments to function 'AsicAddSharedKeyEntry'
/home/phanette/RT73_Linux_STA_Drv1.0.3.6/Module/rtmp_main.c:1056: error: expected ';' before 'KeyIdx'
/home/phanette/RT73_Linux_STA_Drv1.0.3.6/Module/rtmp_main.c:1059: error: 'NDIS_802_11_KEY_INDEX' undeclared (first use in this function)
/home/phanette/RT73_Linux_STA_Drv1.0.3.6/Module/rtmp_main.c:1059: error: expected expression before ')' token
/home/phanette/RT73_Linux_STA_Drv1.0.3.6/Module/rtmp_main.c:1075: error: 'struct _RTMP_ADAPTER' has no member named 'SharedKey'
/home/phanette/RT73_Linux_STA_Drv1.0.3.6/Module/rtmp_main.c:1076: error: 'struct _RTMP_ADAPTER' has no member named 'SharedKey'
/home/phanette/RT73_Linux_STA_Drv1.0.3.6/Module/rtmp_main.c:1077: error: expected ')' before 'KeyIdx'
/home/phanette/RT73_Linux_STA_Drv1.0.3.6/Module/rtmp_main.c:1077: error: too many arguments to function 'AsicRemoveSharedKeyEntry'
/home/phanette/RT73_Linux_STA_Drv1.0.3.6/Module/rtmp_main.c:1087: error: expected ';' before 'i'
/home/phanette/RT73_Linux_STA_Drv1.0.3.6/Module/rtmp_main.c:1090: error: 'struct _NDIS_802_11_KEY' has no member named 'KeyIndex'
/home/phanette/RT73_Linux_STA_Drv1.0.3.6/Module/rtmp_main.c:1100: error: expected ';' before 'CipherAlg'
/home/phanette/RT73_Linux_STA_Drv1.0.3.6/Module/rtmp_main.c:1102: error: 'struct _RTMP_ADAPTER' has no member named 'SharedKey'
/home/phanette/RT73_Linux_STA_Drv1.0.3.6/Module/rtmp_main.c:1102: error: expected ';' before 'pKey'
/home/phanette/RT73_Linux_STA_Drv1.0.3.6/Module/rtmp_main.c:1103: error: 'struct _RTMP_ADAPTER' has no member named 'SharedKey'
/home/phanette/RT73_Linux_STA_Drv1.0.3.6/Module/rtmp_main.c:1103: error: 'struct _NDIS_802_11_KEY' has no member named 'KeyMaterial'
/home/phanette/RT73_Linux_STA_Drv1.0.3.6/Module/rtmp_main.c:1103: error: 'struct _NDIS_802_11_KEY' has no member named 'KeyLength'
/home/phanette/RT73_Linux_STA_Drv1.0.3.6/Module/rtmp_main.c:1103: error: too many arguments to function 'RTMPMoveMemory'
/home/phanette/RT73_Linux_STA_Drv1.0.3.6/Module/rtmp_main.c:1105: error: 'struct _NDIS_802_11_KEY' has no member named 'KeyLength'
/home/phanette/RT73_Linux_STA_Drv1.0.3.6/Module/rtmp_main.c:1113: error: 'struct _NDIS_802_11_KEY' has no member named 'KeyLength'
/home/phanette/RT73_Linux_STA_Drv1.0.3.6/Module/rtmp_main.c:1115: error: 'struct _NDIS_802_11_KEY' has no member named 'KeyLength'
/home/phanette/RT73_Linux_STA_Drv1.0.3.6/Module/rtmp_main.c:1117: error: 'struct _RTMP_ADAPTER' has no member named 'SharedKey'
/home/phanette/RT73_Linux_STA_Drv1.0.3.6/Module/rtmp_main.c:1117: error: 'struct _NDIS_802_11_KEY' has no member named 'KeyLength'
/home/phanette/RT73_Linux_STA_Drv1.0.3.6/Module/rtmp_main.c:1117: error: 'struct _NDIS_802_11_KEY' has no member named 'KeyMaterial'
/home/phanette/RT73_Linux_STA_Drv1.0.3.6/Module/rtmp_main.c:1117: error: 'struct _NDIS_802_11_KEY' has no member named 'KeyLength'
/home/phanette/RT73_Linux_STA_Drv1.0.3.6/Module/rtmp_main.c:1117: error: too many arguments to function 'RTMPMoveMemory'
/home/phanette/RT73_Linux_STA_Drv1.0.3.6/Module/rtmp_main.c:1121: error: 'struct _RTMP_ADAPTER' has no member named 'SharedKey'
/home/phanette/RT73_Linux_STA_Drv1.0.3.6/Module/rtmp_main.c:1121: error: 'struct _NDIS_802_11_KEY' has no member named 'KeyLength'
/home/phanette/RT73_Linux_STA_Drv1.0.3.6/Module/rtmp_main.c:1121: error: 'struct _NDIS_802_11_KEY' has no member named 'KeyMaterial'
/home/phanette/RT73_Linux_STA_Drv1.0.3.6/Module/rtmp_main.c:1121: error: 'struct _NDIS_802_11_KEY' has no member named 'KeyLength'
/home/phanette/RT73_Linux_STA_Drv1.0.3.6/Module/rtmp_main.c:1121: error: too many arguments to function 'RTMPMoveMemory'
/home/phanette/RT73_Linux_STA_Drv1.0.3.6/Module/rtmp_main.c:1126: error: 'struct _RTMP_ADAPTER' has no member named 'SharedKey'
/home/phanette/RT73_Linux_STA_Drv1.0.3.6/Module/rtmp_main.c:1127: error: 'struct _NDIS_802_11_KEY' has no member named 'KeyIndex'
/home/phanette/RT73_Linux_STA_Drv1.0.3.6/Module/rtmp_main.c:1130: error: 'struct _RTMP_ADAPTER' has no member named 'PortCfg'
/home/phanette/RT73_Linux_STA_Drv1.0.3.6/Module/rtmp_main.c:1130: error: expected ';' before 'KeyIdx'
/home/phanette/RT73_Linux_STA_Drv1.0.3.6/Module/rtmp_main.c:1133: error: expected ')' before 'KeyIdx'
/home/phanette/RT73_Linux_STA_Drv1.0.3.6/Module/rtmp_main.c:1133: error: too many arguments to function 'AsicAddSharedKeyEntry'
/home/phanette/RT73_Linux_STA_Drv1.0.3.6/Module/rtmp_main.c:1221: error: expected ';' before 'KeyIdx'
/home/phanette/RT73_Linux_STA_Drv1.0.3.6/Module/rtmp_main.c:1224: error: 'struct _RTMP_ADAPTER' has no member named 'PortCfg'
/home/phanette/RT73_Linux_STA_Drv1.0.3.6/Module/rtmp_main.c:1231: error: 'struct _NDIS_802_11_REMOVE_KEY' has no member named 'KeyIndex'
/home/phanette/RT73_Linux_STA_Drv1.0.3.6/Module/rtmp_main.c:1249: error: 'struct _RTMP_ADAPTER' has no member named 'SharedKey'
/home/phanette/RT73_Linux_STA_Drv1.0.3.6/Module/rtmp_main.c:1250: error: 'struct _RTMP_ADAPTER' has no member named 'SharedKey'
/home/phanette/RT73_Linux_STA_Drv1.0.3.6/Module/rtmp_main.c:1251: error: expected ')' before 'KeyIdx'
/home/phanette/RT73_Linux_STA_Drv1.0.3.6/Module/rtmp_main.c:1251: error: too many arguments to function 'AsicRemoveSharedKeyEntry'
/home/phanette/RT73_Linux_STA_Drv1.0.3.6/Module/rtmp_main.c:1269: error: too many arguments to function 'MlmeSetPsmBit'
/home/phanette/RT73_Linux_STA_Drv1.0.3.6/Module/rtmp_main.c:1271: error: 'struct _RTMP_ADAPTER' has no member named 'PortCfg'
/home/phanette/RT73_Linux_STA_Drv1.0.3.6/Module/rtmp_main.c:1272: error: 'struct _RTMP_ADAPTER' has no member named 'PortCfg'
/home/phanette/RT73_Linux_STA_Drv1.0.3.6/Module/rtmp_main.c:1273: error: 'struct _RTMP_ADAPTER' has no member named 'PortCfg'
/home/phanette/RT73_Linux_STA_Drv1.0.3.6/Module/rtmp_main.c:1274: error: 'struct _RTMP_ADAPTER' has no member named 'PortCfg'
/home/phanette/RT73_Linux_STA_Drv1.0.3.6/Module/rtmp_main.c:1281: error: 'struct _RTMP_ADAPTER' has no member named 'PortCfg'
/home/phanette/RT73_Linux_STA_Drv1.0.3.6/Module/rtmp_main.c:1282: error: 'struct _RTMP_ADAPTER' has no member named 'PortCfg'
/home/phanette/RT73_Linux_STA_Drv1.0.3.6/Module/rtmp_main.c:1283: error: 'struct _RTMP_ADAPTER' has no member named 'PortCfg'
/home/phanette/RT73_Linux_STA_Drv1.0.3.6/Module/rtmp_main.c:1284: error: 'struct _RTMP_ADAPTER' has no member named 'PortCfg'
/home/phanette/RT73_Linux_STA_Drv1.0.3.6/Module/rtmp_main.c:1285: error: 'struct _RTMP_ADAPTER' has no member named 'PortCfg'
/home/phanette/RT73_Linux_STA_Drv1.0.3.6/Module/rtmp_main.c:1292: error: 'struct _RTMP_ADAPTER' has no member named 'PortCfg'
/home/phanette/RT73_Linux_STA_Drv1.0.3.6/Module/rtmp_main.c:1293: error: 'struct _RTMP_ADAPTER' has no member named 'PortCfg'
/home/phanette/RT73_Linux_STA_Drv1.0.3.6/Module/rtmp_main.c:1294: error: 'struct _RTMP_ADAPTER' has no member named 'PortCfg'
/home/phanette/RT73_Linux_STA_Drv1.0.3.6/Module/rtmp_main.c:1295: error: 'struct _RTMP_ADAPTER' has no member named 'PortCfg'
/home/phanette/RT73_Linux_STA_Drv1.0.3.6/Module/rtmp_main.c:1296: error: 'struct _RTMP_ADAPTER' has no member named 'PortCfg'
/home/phanette/RT73_Linux_STA_Drv1.0.3.6/Module/rtmp_main.c:1310: error: too many arguments to function 'MlmeSetPsmBit'
/home/phanette/RT73_Linux_STA_Drv1.0.3.6/Module/rtmp_main.c:1318: error: 'struct _CmdQElmt' has no member named 'CmdFromNdis'
/home/phanette/RT73_Linux_STA_Drv1.0.3.6/Module/rtmp_main.c:1320: error: 'struct _CmdQElmt' has no member named 'command'
/home/phanette/RT73_Linux_STA_Drv1.0.3.6/Module/rtmp_main.c:1321: error: 'struct _CmdQElmt' has no member named 'command'
/home/phanette/RT73_Linux_STA_Drv1.0.3.6/Module/rtmp_main.c:1322: error: 'struct _CmdQElmt' has no member named 'command'
/home/phanette/RT73_Linux_STA_Drv1.0.3.6/Module/rtmp_main.c:1323: error: 'struct _CmdQElmt' has no member named 'command'
/home/phanette/RT73_Linux_STA_Drv1.0.3.6/Module/rtmp_main.c:1327: error: 'struct _CmdQElmt' has no member named 'command'
/home/phanette/RT73_Linux_STA_Drv1.0.3.6/Module/rtmp_main.c:1328: error: 'struct _CmdQElmt' has no member named 'command'
/home/phanette/RT73_Linux_STA_Drv1.0.3.6/Module/rtmp_main.c:1332: error: 'struct _CmdQElmt' has no member named 'command'
/home/phanette/RT73_Linux_STA_Drv1.0.3.6/Module/rtmp_main.c:1334: error: 'struct _CmdQElmt' has no member named 'buffer'
/home/phanette/RT73_Linux_STA_Drv1.0.3.6/Module/rtmp_main.c:1335: error: 'struct _CmdQElmt' has no member named 'buffer'
/home/phanette/RT73_Linux_STA_Drv1.0.3.6/Module/rtmp_main.c:1341: error: 'struct _CmdQElmt' has no member named 'InUse'
/home/phanette/RT73_Linux_STA_Drv1.0.3.6/Module/rtmp_main.c: In function 'usb_rtusb_open':
/home/phanette/RT73_Linux_STA_Drv1.0.3.6/Module/rtmp_main.c:1352: error: 'u8' undeclared (first use in this function)
/home/phanette/RT73_Linux_STA_Drv1.0.3.6/Module/rtmp_main.c:1352: error: expected ';' before 'TmpPhy'
/home/phanette/RT73_Linux_STA_Drv1.0.3.6/Module/rtmp_main.c:1356: warning: implicit declaration of function 'init_MUTEX'
/home/phanette/RT73_Linux_STA_Drv1.0.3.6/Module/rtmp_main.c:1359: error: 'struct _RTMP_ADAPTER' has no member named 'PortCfg'
/home/phanette/RT73_Linux_STA_Drv1.0.3.6/Module/rtmp_main.c:1361: error: 'struct tasklet_struct' has no member named 'func'
/home/phanette/RT73_Linux_STA_Drv1.0.3.6/Module/rtmp_main.c:1395: error: 'u32' undeclared (first use in this function)
/home/phanette/RT73_Linux_STA_Drv1.0.3.6/Module/rtmp_main.c:1395: error: expected ';' before 'MacCsr0'
/home/phanette/RT73_Linux_STA_Drv1.0.3.6/Module/rtmp_main.c:1399: error: 'MacCsr0' undeclared (first use in this function)
/home/phanette/RT73_Linux_STA_Drv1.0.3.6/Module/rtmp_main.c:1399: error: too many arguments to function 'RTUSBReadMACRegister'
/home/phanette/RT73_Linux_STA_Drv1.0.3.6/Module/rtmp_main.c:1405: error: 'Index' undeclared (first use in this function)
/home/phanette/RT73_Linux_STA_Drv1.0.3.6/Module/rtmp_main.c:1435: error: 'struct _RTMP_ADAPTER' has no member named 'NicConfig2'
/home/phanette/RT73_Linux_STA_Drv1.0.3.6/Module/rtmp_main.c:1437: error: 'struct _RTMP_ADAPTER' has no member named 'BbpTuning'
/home/phanette/RT73_Linux_STA_Drv1.0.3.6/Module/rtmp_main.c:1438: error: 'struct _RTMP_ADAPTER' has no member named 'BbpTuning'
/home/phanette/RT73_Linux_STA_Drv1.0.3.6/Module/rtmp_main.c:1439: error: 'struct _RTMP_ADAPTER' has no member named 'BbpTuning'
/home/phanette/RT73_Linux_STA_Drv1.0.3.6/Module/rtmp_main.c:1440: error: 'struct _RTMP_ADAPTER' has no member named 'BbpTuning'
/home/phanette/RT73_Linux_STA_Drv1.0.3.6/Module/rtmp_main.c:1445: error: 'TmpPhy' undeclared (first use in this function)
/home/phanette/RT73_Linux_STA_Drv1.0.3.6/Module/rtmp_main.c:1445: error: 'struct _RTMP_ADAPTER' has no member named 'PortCfg'
/home/phanette/RT73_Linux_STA_Drv1.0.3.6/Module/rtmp_main.c:1446: error: 'struct _RTMP_ADAPTER' has no member named 'PortCfg'
/home/phanette/RT73_Linux_STA_Drv1.0.3.6/Module/rtmp_main.c:1447: error: too many arguments to function 'RTMPSetPhyMode'
/home/phanette/RT73_Linux_STA_Drv1.0.3.6/Module/rtmp_main.c:1465: error: 'struct _RTMP_ADAPTER' has no member named 'CurrentAddress'
/home/phanette/RT73_Linux_STA_Drv1.0.3.6/Module/rtmp_main.c:1465: error: too many arguments to function 'memcpy'
/home/phanette/RT73_Linux_STA_Drv1.0.3.6/Module/rtmp_main.c:1469: error: 'struct _RTMP_ADAPTER' has no member named 'Flags'
/home/phanette/RT73_Linux_STA_Drv1.0.3.6/Module/rtmp_main.c:1472: error: 'struct _RTMP_ADAPTER' has no member named 'Flags'
/home/phanette/RT73_Linux_STA_Drv1.0.3.6/Module/rtmp_main.c:1475: error: too many arguments to function 'RTUSBWriteMACRegister'
/home/phanette/RT73_Linux_STA_Drv1.0.3.6/Module/rtmp_main.c:1477: error: 'struct _RTMP_ADAPTER' has no member named 'PortCfg'
/home/phanette/RT73_Linux_STA_Drv1.0.3.6/Module/rtmp_main.c:1477: error: too many arguments to function 'AsicSwitchChannel'
/home/phanette/RT73_Linux_STA_Drv1.0.3.6/Module/rtmp_main.c:1478: error: 'struct _RTMP_ADAPTER' has no member named 'PortCfg'
/home/phanette/RT73_Linux_STA_Drv1.0.3.6/Module/rtmp_main.c:1478: error: too many arguments to function 'AsicLockChannel'
/home/phanette/RT73_Linux_STA_Drv1.0.3.6/Module/rtmp_main.c:1483: error: 'struct _RTMP_ADAPTER' has no member named 'VendorDesc'
/home/phanette/RT73_Linux_STA_Drv1.0.3.6/Module/rtmp_main.c:1494: error: too many arguments to function 'ReleaseAdapter'
/home/phanette/RT73_Linux_STA_Drv1.0.3.6/Module/rtmp_main.c:1499:5: warning: "LINUX_VERSION_CODE" is not defined
/home/phanette/RT73_Linux_STA_Drv1.0.3.6/Module/rtmp_main.c: In function 'usb_rtusb_close':
/home/phanette/RT73_Linux_STA_Drv1.0.3.6/Module/rtmp_main.c:1507: error: 'current' undeclared (first use in this function)
/home/phanette/RT73_Linux_STA_Drv1.0.3.6/Module/rtmp_main.c:1517: error: 'struct _RTMP_ADAPTER' has no member named 'wait'
/home/phanette/RT73_Linux_STA_Drv1.0.3.6/Module/rtmp_main.c:1519: error: 'struct _RTMP_ADAPTER' has no member named 'PendingRx'
/home/phanette/RT73_Linux_STA_Drv1.0.3.6/Module/rtmp_main.c:1524: error: 'struct _RTMP_ADAPTER' has no member named 'wait'
/home/phanette/RT73_Linux_STA_Drv1.0.3.6/Module/rtmp_main.c:1527: error: 'struct _RTMP_ADAPTER' has no member named 'MLMEThr_pid'
/home/phanette/RT73_Linux_STA_Drv1.0.3.6/Module/rtmp_main.c:1530: error: 'struct _RTMP_ADAPTER' has no member named 'MLMEThr_pid'
/home/phanette/RT73_Linux_STA_Drv1.0.3.6/Module/rtmp_main.c:1531: warning: implicit declaration of function 'wmb'
/home/phanette/RT73_Linux_STA_Drv1.0.3.6/Module/rtmp_main.c:1532: warning: implicit declaration of function 'kill_proc'
/home/phanette/RT73_Linux_STA_Drv1.0.3.6/Module/rtmp_main.c:1532: error: 'struct _RTMP_ADAPTER' has no member named 'MLMEThr_pid'
/home/phanette/RT73_Linux_STA_Drv1.0.3.6/Module/rtmp_main.c:1532: error: 'SIGTERM' undeclared (first use in this function)
/home/phanette/RT73_Linux_STA_Drv1.0.3.6/Module/rtmp_main.c:1540: error: 'struct _RTMP_ADAPTER' has no member named 'RTUSBCmdThr_pid'
/home/phanette/RT73_Linux_STA_Drv1.0.3.6/Module/rtmp_main.c:1543: error: 'struct _RTMP_ADAPTER' has no member named 'RTUSBCmdThr_pid'
/home/phanette/RT73_Linux_STA_Drv1.0.3.6/Module/rtmp_main.c:1545: error: 'struct _RTMP_ADAPTER' has no member named 'RTUSBCmdThr_pid'
/home/phanette/RT73_Linux_STA_Drv1.0.3.6/Module/rtmp_main.c:1554: error: too many arguments to function 'RTUSBHalt'
/home/phanette/RT73_Linux_STA_Drv1.0.3.6/Module/rtmp_main.c: In function 'MlmeThread':
/home/phanette/RT73_Linux_STA_Drv1.0.3.6/Module/rtmp_main.c:1565: error: too few arguments to function 'daemonize'
/home/phanette/RT73_Linux_STA_Drv1.0.3.6/Module/rtmp_main.c:1566: error: 'current' undeclared (first use in this function)
/home/phanette/RT73_Linux_STA_Drv1.0.3.6/Module/rtmp_main.c:1576: warning: implicit declaration of function 'down'
/home/phanette/RT73_Linux_STA_Drv1.0.3.6/Module/rtmp_main.c: In function 'RTUSBCmdThread':
/home/phanette/RT73_Linux_STA_Drv1.0.3.6/Module/rtmp_main.c:1633: error: too few arguments to function 'daemonize'
/home/phanette/RT73_Linux_STA_Drv1.0.3.6/Module/rtmp_main.c:1634: error: 'current' undeclared (first use in this function)
/home/phanette/RT73_Linux_STA_Drv1.0.3.6/Module/rtmp_main.c: At top level:
/home/phanette/RT73_Linux_STA_Drv1.0.3.6/Module/rtmp_main.c:1676: error: expected declaration specifiers or '...' before 'u32'
/home/phanette/RT73_Linux_STA_Drv1.0.3.6/Module/rtmp_main.c: In function 'usb_rtusb_probe':
/home/phanette/RT73_Linux_STA_Drv1.0.3.6/Module/rtmp_main.c:1682: error: 'ENOMEM' undeclared (first use in this function)
/home/phanette/RT73_Linux_STA_Drv1.0.3.6/Module/rtmp_main.c:1686: error: 'struct usb_device_descriptor' has no member named 'idVendor'
/home/phanette/RT73_Linux_STA_Drv1.0.3.6/Module/rtmp_main.c:1686: error: 'struct usb_device_id' has no member named 'idVendor'
/home/phanette/RT73_Linux_STA_Drv1.0.3.6/Module/rtmp_main.c:1687: error: 'struct usb_device_descriptor' has no member named 'idProduct'
/home/phanette/RT73_Linux_STA_Drv1.0.3.6/Module/rtmp_main.c:1687: error: 'struct usb_device_id' has no member named 'idProduct'
/home/phanette/RT73_Linux_STA_Drv1.0.3.6/Module/rtmp_main.c:1689: error: 'struct usb_device_descriptor' has no member named 'idVendor'
/home/phanette/RT73_Linux_STA_Drv1.0.3.6/Module/rtmp_main.c:1689: error: 'struct usb_device_descriptor' has no member named 'idProduct'
/home/phanette/RT73_Linux_STA_Drv1.0.3.6/Module/rtmp_main.c:1703: error: 'MOD_DEC_USE_COUNT' undeclared (first use in this function)
/home/phanette/RT73_Linux_STA_Drv1.0.3.6/Module/rtmp_main.c:1704: warning: implicit declaration of function 'usb_dec_dev_use'
/home/phanette/RT73_Linux_STA_Drv1.0.3.6/Module/rtmp_main.c:1711: warning: assignment from incompatible pointer type
/home/phanette/RT73_Linux_STA_Drv1.0.3.6/Module/rtmp_main.c:1716: error: 'struct net_device' has no member named 'open'
/home/phanette/RT73_Linux_STA_Drv1.0.3.6/Module/rtmp_main.c:1718: error: 'struct net_device' has no member named 'stop'
/home/phanette/RT73_Linux_STA_Drv1.0.3.6/Module/rtmp_main.c:1725: error: 'struct net_device' has no member named 'do_ioctl'
/home/phanette/RT73_Linux_STA_Drv1.0.3.6/Module/rtmp_main.c:1731: error: 'struct _RTMP_ADAPTER' has no member named 'PortCfg'
/home/phanette/RT73_Linux_STA_Drv1.0.3.6/Module/rtmp_main.c:1737: error: 'interface' undeclared (first use in this function)
/home/phanette/RT73_Linux_STA_Drv1.0.3.6/Module/rtmp_main.c:1745: error: invalid type argument of '->'
/home/phanette/RT73_Linux_STA_Drv1.0.3.6/Module/rtmp_main.c:1748: error: too many arguments to function 'strncmp'
/home/phanette/RT73_Linux_STA_Drv1.0.3.6/Module/rtmp_main.c:1768: error: 'struct usb_interface' has no member named 'act_altsetting'
/home/phanette/RT73_Linux_STA_Drv1.0.3.6/Module/rtmp_main.c:1769: error: 'struct usb_interface_descriptor' has no member named 'endpoint'
/home/phanette/RT73_Linux_STA_Drv1.0.3.6/Module/rtmp_main.c:1771: error: 'struct _RTMP_ADAPTER' has no member named 'BulkOutMaxPacketSize'
/home/phanette/RT73_Linux_STA_Drv1.0.3.6/Module/rtmp_main.c:1771: error: 'u16' undeclared (first use in this function)
/home/phanette/RT73_Linux_STA_Drv1.0.3.6/Module/rtmp_main.c:1771: error: expected ';' before 'ep'
/home/phanette/RT73_Linux_STA_Drv1.0.3.6/Module/rtmp_main.c:1778: error: 'struct tasklet_struct' has no member named 'func'
/home/phanette/RT73_Linux_STA_Drv1.0.3.6/Module/rtmp_main.c: In function 'usb_rtusb_disconnect':
/home/phanette/RT73_Linux_STA_Drv1.0.3.6/Module/rtmp_main.c:1802: error: 'struct _RTMP_ADAPTER' has no member named 'Flags'
/home/phanette/RT73_Linux_STA_Drv1.0.3.6/Module/rtmp_main.c:1804: warning: implicit declaration of function 'udelay'
/home/phanette/RT73_Linux_STA_Drv1.0.3.6/Module/rtmp_main.c:1816: error: 'MOD_IN_USE' undeclared (first use in this function)
/home/phanette/RT73_Linux_STA_Drv1.0.3.6/Module/rtmp_main.c:1817: error: 'MOD_DEC_USE_COUNT' undeclared (first use in this function)
make[2]: *** [/home/phanette/RT73_Linux_STA_Drv1.0.3.6/Module/rtmp_main.o] Erreur 1
make[1]: *** [_module_/home/phanette/RT73_Linux_STA_Drv1.0.3.6/Module] Erreur 2
make[1]: quittant le répertoire « /usr/src/linux-source-2.6.17 »
make: *** [all] Erreur 2