Building CXX object scribus/CMakeFiles/scribus.dir/scribusdoc.o
/home/mrdocs/cvs/13/Scribus/scribus/scribusdoc.moc: In member function virtual bool ScribusDoc::qt_invoke(int, QUObject*):
/home/mrdocs/cvs/13/Scribus/scribus/scribusdoc.moc:515: error: no matching function for call to ScribusDoc::itemSelection_SetParagraphStyle(int)
/home/mrdocs/cvs/13/Scribus/scribus/scribusdoc.h:681: note: candidates are: void ScribusDoc::itemSelection_SetParagraphStyle(const ParagraphStyle&)
/home/mrdocs/cvs/13/Scribus/scribus/scribusdoc.cpp: In member function void ScribusDoc::itemSelection_SetLineSpacingMode(int):
/home/mrdocs/cvs/13/Scribus/scribus/scribusdoc.cpp:5576: warning: unused variable currItem
make[2]: *** [scribus/CMakeFiles/scribus.dir/scribusdoc.o] Error 1
make[1]: *** [scribus/CMakeFiles/scribus.dir/all] Error 2
make: *** [all] Error 2