All pastes #21653 Raw Edit

Something

public text v1 · immutable
#21653 ·published 2005-08-30 22:16 UTC
rendered paste body
This file contains any messages produced by compilers while
running configure, to aid debugging if configure makes a mistake.

It was created by configure, which was
generated by GNU Autoconf 2.59.  Invocation command line was

  $ ./configure 

## --------- ##
## Platform. ##
## --------- ##

hostname = piko.hoomaha.net
uname -m = i686
uname -r = 2.6.12-8mdksmp
uname -s = Linux
uname -v = #1 SMP Wed Jul 27 14:55:12 CDT 2005

/usr/bin/uname -p = unknown
/bin/uname -X     = unknown

/bin/arch              = i686
/usr/bin/arch -k       = unknown
/usr/convex/getsysinfo = unknown
hostinfo               = unknown
/bin/machine           = unknown
/usr/bin/oslevel       = unknown
/bin/universe          = unknown

PATH: /usr/local/bin
PATH: /bin
PATH: /usr/bin
PATH: /usr/X11R6/bin
PATH: /usr/games
PATH: /home/wili/bin


## ----------- ##
## Core tests. ##
## ----------- ##

configure:1385: checking build system type
configure:1403: result: i686-pc-linux-gnu
configure:1411: checking host system type
configure:1425: result: i686-pc-linux-gnu
configure:1433: checking target system type
configure:1447: result: i686-pc-linux-gnu
configure:1475: checking for a BSD-compatible install
configure:1530: result: /usr/bin/install -c
configure:1541: checking whether build environment is sane
configure:1584: result: yes
configure:1649: checking for gawk
configure:1665: found /bin/gawk
configure:1675: result: gawk
configure:1685: checking whether make sets $(MAKE)
configure:1705: result: yes
configure:1889: checking for whoami
configure:1905: found /usr/bin/whoami
configure:1916: result: yes
configure:1983: checking whether make sets $(MAKE)
configure:2003: result: yes
configure:2058: checking for gcc
configure:2074: found /usr/bin/gcc
configure:2084: result: gcc
configure:2328: checking for C compiler version
configure:2331: gcc --version </dev/null >&5
gcc (GCC) 3.4.3 (Mandrakelinux 10.2 3.4.3-7mdk)
Copyright (C) 2004 Free Software Foundation, Inc.
This is free software; see the source for copying conditions.  There is NO
warranty; not even for MERCHANTABILITY or FITNESS FOR A PARTICULAR PURPOSE.

configure:2334: $? = 0
configure:2336: gcc -v </dev/null >&5
Reading specs from /usr/lib/gcc/i586-mandrake-linux-gnu/3.4.3/specs
Configured with: ../configure --prefix=/usr --libexecdir=/usr/lib --with-slibdir=/lib --mandir=/usr/share/man --infodir=/usr/share/info --enable-shared --enable-threads=posix --disable-checking --enable-long-long --enable-__cxa_atexit --enable-clocale=gnu --disable-libunwind-exceptions --enable-languages=c,c++,ada,f77,objc,java --host=i586-mandrake-linux-gnu --with-system-zlib
Thread model: posix
gcc version 3.4.3 (Mandrakelinux 10.2 3.4.3-7mdk)
configure:2339: $? = 0
configure:2341: gcc -V </dev/null >&5
gcc: `-V' option must have argument
configure:2344: $? = 1
configure:2367: checking for C compiler default output file name
configure:2370: gcc    conftest.c  >&5
configure:2373: $? = 0
configure:2419: result: a.out
configure:2424: checking whether the C compiler works
configure:2430: ./a.out
configure:2433: $? = 0
configure:2450: result: yes
configure:2457: checking whether we are cross compiling
configure:2459: result: no
configure:2462: checking for suffix of executables
configure:2464: gcc -o conftest    conftest.c  >&5
configure:2467: $? = 0
configure:2492: result: 
configure:2498: checking for suffix of object files
configure:2519: gcc -c   conftest.c >&5
configure:2522: $? = 0
configure:2544: result: o
configure:2548: checking whether we are using the GNU C compiler
configure:2572: gcc -c   conftest.c >&5
configure:2578: $? = 0
configure:2582: test -z 
			 || test ! -s conftest.err
configure:2585: $? = 0
configure:2588: test -s conftest.o
configure:2591: $? = 0
configure:2604: result: yes
configure:2610: checking whether gcc accepts -g
configure:2631: gcc -c -g  conftest.c >&5
configure:2637: $? = 0
configure:2641: test -z 
			 || test ! -s conftest.err
configure:2644: $? = 0
configure:2647: test -s conftest.o
configure:2650: $? = 0
configure:2661: result: yes
configure:2678: checking for gcc option to accept ANSI C
configure:2748: gcc  -c -g -O2  conftest.c >&5
configure:2754: $? = 0
configure:2758: test -z 
			 || test ! -s conftest.err
configure:2761: $? = 0
configure:2764: test -s conftest.o
configure:2767: $? = 0
configure:2785: result: none needed
configure:2803: gcc -c -g -O2  conftest.c >&5
conftest.c:2: error: syntax error before "me"
configure:2809: $? = 1
configure: failed program was:
| #ifndef __cplusplus
|   choke me
| #endif
configure:2953: checking for style of include used by make
configure:2981: result: GNU
configure:3009: checking dependency style of gcc
configure:3099: result: gcc3
configure:3168: checking for g++
configure:3184: found /usr/bin/g++
configure:3194: result: g++
configure:3210: checking for C++ compiler version
configure:3213: g++ --version </dev/null >&5
g++ (GCC) 3.4.3 (Mandrakelinux 10.2 3.4.3-7mdk)
Copyright (C) 2004 Free Software Foundation, Inc.
This is free software; see the source for copying conditions.  There is NO
warranty; not even for MERCHANTABILITY or FITNESS FOR A PARTICULAR PURPOSE.

configure:3216: $? = 0
configure:3218: g++ -v </dev/null >&5
Reading specs from /usr/lib/gcc/i586-mandrake-linux-gnu/3.4.3/specs
Configured with: ../configure --prefix=/usr --libexecdir=/usr/lib --with-slibdir=/lib --mandir=/usr/share/man --infodir=/usr/share/info --enable-shared --enable-threads=posix --disable-checking --enable-long-long --enable-__cxa_atexit --enable-clocale=gnu --disable-libunwind-exceptions --enable-languages=c,c++,ada,f77,objc,java --host=i586-mandrake-linux-gnu --with-system-zlib
Thread model: posix
gcc version 3.4.3 (Mandrakelinux 10.2 3.4.3-7mdk)
configure:3221: $? = 0
configure:3223: g++ -V </dev/null >&5
g++: `-V' option must have argument
configure:3226: $? = 1
configure:3229: checking whether we are using the GNU C++ compiler
configure:3253: g++ -c   conftest.cc >&5
configure:3259: $? = 0
configure:3263: test -z 
			 || test ! -s conftest.err
configure:3266: $? = 0
configure:3269: test -s conftest.o
configure:3272: $? = 0
configure:3285: result: yes
configure:3291: checking whether g++ accepts -g
configure:3312: g++ -c -g  conftest.cc >&5
configure:3318: $? = 0
configure:3322: test -z 
			 || test ! -s conftest.err
configure:3325: $? = 0
configure:3328: test -s conftest.o
configure:3331: $? = 0
configure:3342: result: yes
configure:3384: g++ -c -g -O2  conftest.cc >&5
configure:3390: $? = 0
configure:3394: test -z 
			 || test ! -s conftest.err
configure:3397: $? = 0
configure:3400: test -s conftest.o
configure:3403: $? = 0
configure:3429: g++ -c -g -O2  conftest.cc >&5
conftest.cc: In function `int main()':
conftest.cc:18: error: `exit' undeclared (first use this function)
conftest.cc:18: error: (Each undeclared identifier is reported only once for each function it appears in.)
configure:3435: $? = 1
configure: failed program was:
| /* confdefs.h.  */
| 
| #define PACKAGE_NAME ""
| #define PACKAGE_TARNAME ""
| #define PACKAGE_VERSION ""
| #define PACKAGE_STRING ""
| #define PACKAGE_BUGREPORT ""
| #define PACKAGE "bzflag"
| #define VERSION "2.0.3.20050830"
| #define BZ_BUILD_OS "linux-gnu"
| #define BZ_BUILD_USER "wili"
| #define BUILD_REGEX 1
| /* end confdefs.h.  */
| 
| int
| main ()
| {
| exit (42);
|   ;
|   return 0;
| }
configure:3384: g++ -c -g -O2  conftest.cc >&5
configure:3390: $? = 0
configure:3394: test -z 
			 || test ! -s conftest.err
configure:3397: $? = 0
configure:3400: test -s conftest.o
configure:3403: $? = 0
configure:3429: g++ -c -g -O2  conftest.cc >&5
configure:3435: $? = 0
configure:3439: test -z 
			 || test ! -s conftest.err
configure:3442: $? = 0
configure:3445: test -s conftest.o
configure:3448: $? = 0
configure:3473: checking dependency style of g++
configure:3563: result: gcc3
configure:3584: checking for ccache
configure:3617: result: no
configure:3668: checking for windres
configure:3695: result: :
configure:3766: checking whether ln -s works
configure:3770: result: yes
configure:3818: checking for ranlib
configure:3834: found /usr/bin/ranlib
configure:3845: result: ranlib
configure:3859: checking for pod2man
configure:3875: found /usr/bin/pod2man
configure:3886: result: yes
configure:3910: checking for ar
configure:3926: found /usr/bin/ar
configure:3936: result: ar
configure:3945: checking for compress in -lz
configure:3975: gcc -o conftest -g -O2   conftest.c -lz   >&5
configure:3981: $? = 0
configure:3985: test -z 
			 || test ! -s conftest.err
configure:3988: $? = 0
configure:3991: test -s conftest
configure:3994: $? = 0
configure:4007: result: yes
configure:4036: checking for curl >= 7.10.0
configure:4046: result: 7.13.1
configure:4140: checking for artificial intelligence for bz's robots
configure:4142: result: not found
configure:4151: checking how to run the C preprocessor
configure:4186: gcc -E  conftest.c
configure:4192: $? = 0
configure:4224: gcc -E  conftest.c
conftest.c:17:28: ac_nonexistent.h: No such file or directory
configure:4230: $? = 1
configure: failed program was:
| /* confdefs.h.  */
| 
| #define PACKAGE_NAME ""
| #define PACKAGE_TARNAME ""
| #define PACKAGE_VERSION ""
| #define PACKAGE_STRING ""
| #define PACKAGE_BUGREPORT ""
| #define PACKAGE "bzflag"
| #define VERSION "2.0.3.20050830"
| #define BZ_BUILD_OS "linux-gnu"
| #define BZ_BUILD_USER "wili"
| #define BUILD_REGEX 1
| #ifdef __cplusplus
| extern "C" void std::exit (int) throw (); using std::exit;
| #endif
| /* end confdefs.h.  */
| #include <ac_nonexistent.h>
configure:4269: result: gcc -E
configure:4293: gcc -E  conftest.c
configure:4299: $? = 0
configure:4331: gcc -E  conftest.c
conftest.c:17:28: ac_nonexistent.h: No such file or directory
configure:4337: $? = 1
configure: failed program was:
| /* confdefs.h.  */
| 
| #define PACKAGE_NAME ""
| #define PACKAGE_TARNAME ""
| #define PACKAGE_VERSION ""
| #define PACKAGE_STRING ""
| #define PACKAGE_BUGREPORT ""
| #define PACKAGE "bzflag"
| #define VERSION "2.0.3.20050830"
| #define BZ_BUILD_OS "linux-gnu"
| #define BZ_BUILD_USER "wili"
| #define BUILD_REGEX 1
| #ifdef __cplusplus
| extern "C" void std::exit (int) throw (); using std::exit;
| #endif
| /* end confdefs.h.  */
| #include <ac_nonexistent.h>
configure:4381: checking for egrep
configure:4391: result: grep -E
configure:4396: checking for ANSI C header files
configure:4421: gcc -c -g -O2  conftest.c >&5
configure:4427: $? = 0
configure:4431: test -z 
			 || test ! -s conftest.err
configure:4434: $? = 0
configure:4437: test -s conftest.o
configure:4440: $? = 0
configure:4529: gcc -o conftest -g -O2   conftest.c -L/usr/lib -lcurl -lidn -lssl -lcrypto -ldl -lssl -lcrypto -ldl -lz  >&5
configure:4532: $? = 0
configure:4534: ./conftest
configure:4537: $? = 0
configure:4552: result: yes
configure:4583: checking for sys/types.h
configure:4599: g++ -c -g -O2  conftest.cc >&5
configure:4605: $? = 0
configure:4609: test -z 
			 || test ! -s conftest.err
configure:4612: $? = 0
configure:4615: test -s conftest.o
configure:4618: $? = 0
configure:4629: result: yes
configure:4583: checking for sys/stat.h
configure:4599: g++ -c -g -O2  conftest.cc >&5
configure:4605: $? = 0
configure:4609: test -z 
			 || test ! -s conftest.err
configure:4612: $? = 0
configure:4615: test -s conftest.o
configure:4618: $? = 0
configure:4629: result: yes
configure:4583: checking for stdlib.h
configure:4599: g++ -c -g -O2  conftest.cc >&5
configure:4605: $? = 0
configure:4609: test -z 
			 || test ! -s conftest.err
configure:4612: $? = 0
configure:4615: test -s conftest.o
configure:4618: $? = 0
configure:4629: result: yes
configure:4583: checking for string.h
configure:4599: g++ -c -g -O2  conftest.cc >&5
configure:4605: $? = 0
configure:4609: test -z 
			 || test ! -s conftest.err
configure:4612: $? = 0
configure:4615: test -s conftest.o
configure:4618: $? = 0
configure:4629: result: yes
configure:4583: checking for memory.h
configure:4599: g++ -c -g -O2  conftest.cc >&5
configure:4605: $? = 0
configure:4609: test -z 
			 || test ! -s conftest.err
configure:4612: $? = 0
configure:4615: test -s conftest.o
configure:4618: $? = 0
configure:4629: result: yes
configure:4583: checking for strings.h
configure:4599: g++ -c -g -O2  conftest.cc >&5
configure:4605: $? = 0
configure:4609: test -z 
			 || test ! -s conftest.err
configure:4612: $? = 0
configure:4615: test -s conftest.o
configure:4618: $? = 0
configure:4629: result: yes
configure:4583: checking for inttypes.h
configure:4599: g++ -c -g -O2  conftest.cc >&5
configure:4605: $? = 0
configure:4609: test -z 
			 || test ! -s conftest.err
configure:4612: $? = 0
configure:4615: test -s conftest.o
configure:4618: $? = 0
configure:4629: result: yes
configure:4583: checking for stdint.h
configure:4599: g++ -c -g -O2  conftest.cc >&5
configure:4605: $? = 0
configure:4609: test -z 
			 || test ! -s conftest.err
configure:4612: $? = 0
configure:4615: test -s conftest.o
configure:4618: $? = 0
configure:4629: result: yes
configure:4583: checking for unistd.h
configure:4599: g++ -c -g -O2  conftest.cc >&5
configure:4605: $? = 0
configure:4609: test -z 
			 || test ! -s conftest.err
configure:4612: $? = 0
configure:4615: test -s conftest.o
configure:4618: $? = 0
configure:4629: result: yes
configure:4646: checking how to run the C++ preprocessor
configure:4677: g++ -E  conftest.cc
configure:4683: $? = 0
configure:4715: g++ -E  conftest.cc
conftest.cc:27:28: ac_nonexistent.h: No such file or directory
configure:4721: $? = 1
configure: failed program was:
| /* confdefs.h.  */
| 
| #define PACKAGE_NAME ""
| #define PACKAGE_TARNAME ""
| #define PACKAGE_VERSION ""
| #define PACKAGE_STRING ""
| #define PACKAGE_BUGREPORT ""
| #define PACKAGE "bzflag"
| #define VERSION "2.0.3.20050830"
| #define BZ_BUILD_OS "linux-gnu"
| #define BZ_BUILD_USER "wili"
| #define BUILD_REGEX 1
| #ifdef __cplusplus
| extern "C" void std::exit (int) throw (); using std::exit;
| #endif
| #define STDC_HEADERS 1
| #define HAVE_SYS_TYPES_H 1
| #define HAVE_SYS_STAT_H 1
| #define HAVE_STDLIB_H 1
| #define HAVE_STRING_H 1
| #define HAVE_MEMORY_H 1
| #define HAVE_STRINGS_H 1
| #define HAVE_INTTYPES_H 1
| #define HAVE_STDINT_H 1
| #define HAVE_UNISTD_H 1
| /* end confdefs.h.  */
| #include <ac_nonexistent.h>
configure:4760: result: g++ -E
configure:4784: g++ -E  conftest.cc
configure:4790: $? = 0
configure:4822: g++ -E  conftest.cc
conftest.cc:27:28: ac_nonexistent.h: No such file or directory
configure:4828: $? = 1
configure: failed program was:
| /* confdefs.h.  */
| 
| #define PACKAGE_NAME ""
| #define PACKAGE_TARNAME ""
| #define PACKAGE_VERSION ""
| #define PACKAGE_STRING ""
| #define PACKAGE_BUGREPORT ""
| #define PACKAGE "bzflag"
| #define VERSION "2.0.3.20050830"
| #define BZ_BUILD_OS "linux-gnu"
| #define BZ_BUILD_USER "wili"
| #define BUILD_REGEX 1
| #ifdef __cplusplus
| extern "C" void std::exit (int) throw (); using std::exit;
| #endif
| #define STDC_HEADERS 1
| #define HAVE_SYS_TYPES_H 1
| #define HAVE_SYS_STAT_H 1
| #define HAVE_STDLIB_H 1
| #define HAVE_STRING_H 1
| #define HAVE_MEMORY_H 1
| #define HAVE_STRINGS_H 1
| #define HAVE_INTTYPES_H 1
| #define HAVE_STDINT_H 1
| #define HAVE_UNISTD_H 1
| /* end confdefs.h.  */
| #include <ac_nonexistent.h>
configure:4892: checking cstdlib usability
configure:4904: g++ -c -g -O2  conftest.cc >&5
configure:4910: $? = 0
configure:4914: test -z 
			 || test ! -s conftest.err
configure:4917: $? = 0
configure:4920: test -s conftest.o
configure:4923: $? = 0
configure:4933: result: yes
configure:4937: checking cstdlib presence
configure:4947: g++ -E  conftest.cc
configure:4953: $? = 0
configure:4973: result: yes
configure:5008: checking for cstdlib
configure:5015: result: yes
configure:4892: checking cstdio usability
configure:4904: g++ -c -g -O2  conftest.cc >&5
configure:4910: $? = 0
configure:4914: test -z 
			 || test ! -s conftest.err
configure:4917: $? = 0
configure:4920: test -s conftest.o
configure:4923: $? = 0
configure:4933: result: yes
configure:4937: checking cstdio presence
configure:4947: g++ -E  conftest.cc
configure:4953: $? = 0
configure:4973: result: yes
configure:5008: checking for cstdio
configure:5015: result: yes
configure:4892: checking cstring usability
configure:4904: g++ -c -g -O2  conftest.cc >&5
configure:4910: $? = 0
configure:4914: test -z 
			 || test ! -s conftest.err
configure:4917: $? = 0
configure:4920: test -s conftest.o
configure:4923: $? = 0
configure:4933: result: yes
configure:4937: checking cstring presence
configure:4947: g++ -E  conftest.cc
configure:4953: $? = 0
configure:4973: result: yes
configure:5008: checking for cstring
configure:5015: result: yes
configure:5224: checking GL/glx.h usability
configure:5236: gcc -c -g -O2  conftest.c >&5
configure:5242: $? = 0
configure:5246: test -z 
			 || test ! -s conftest.err
configure:5249: $? = 0
configure:5252: test -s conftest.o
configure:5255: $? = 0
configure:5265: result: yes
configure:5269: checking GL/glx.h presence
configure:5279: gcc -E  conftest.c
configure:5285: $? = 0
configure:5305: result: yes
configure:5340: checking for GL/glx.h
configure:5347: result: yes
configure:5224: checking SDL/SDL.h usability
configure:5236: gcc -c -g -O2  conftest.c >&5
configure:5242: $? = 0
configure:5246: test -z 
			 || test ! -s conftest.err
configure:5249: $? = 0
configure:5252: test -s conftest.o
configure:5255: $? = 0
configure:5265: result: yes
configure:5269: checking SDL/SDL.h presence
configure:5279: gcc -E  conftest.c
configure:5285: $? = 0
configure:5305: result: yes
configure:5340: checking for SDL/SDL.h
configure:5347: result: yes
configure:5224: checking X11/Xlib.h usability
configure:5236: gcc -c -g -O2  conftest.c >&5
configure:5242: $? = 0
configure:5246: test -z 
			 || test ! -s conftest.err
configure:5249: $? = 0
configure:5252: test -s conftest.o
configure:5255: $? = 0
configure:5265: result: yes
configure:5269: checking X11/Xlib.h presence
configure:5279: gcc -E  conftest.c
configure:5285: $? = 0
configure:5305: result: yes
configure:5340: checking for X11/Xlib.h
configure:5347: result: yes
configure:5224: checking bstring.h usability
configure:5236: gcc -c -g -O2  conftest.c >&5
conftest.c:67:21: bstring.h: No such file or directory
configure:5242: $? = 1
configure: failed program was:
| /* confdefs.h.  */
| 
| #define PACKAGE_NAME ""
| #define PACKAGE_TARNAME ""
| #define PACKAGE_VERSION ""
| #define PACKAGE_STRING ""
| #define PACKAGE_BUGREPORT ""
| #define PACKAGE "bzflag"
| #define VERSION "2.0.3.20050830"
| #define BZ_BUILD_OS "linux-gnu"
| #define BZ_BUILD_USER "wili"
| #define BUILD_REGEX 1
| #ifdef __cplusplus
| extern "C" void std::exit (int) throw (); using std::exit;
| #endif
| #define STDC_HEADERS 1
| #define HAVE_SYS_TYPES_H 1
| #define HAVE_SYS_STAT_H 1
| #define HAVE_STDLIB_H 1
| #define HAVE_STRING_H 1
| #define HAVE_MEMORY_H 1
| #define HAVE_STRINGS_H 1
| #define HAVE_INTTYPES_H 1
| #define HAVE_STDINT_H 1
| #define HAVE_UNISTD_H 1
| #define HAVE_CSTDLIB 1
| #define HAVE_CSTDIO 1
| #define HAVE_CSTRING 1
| #define HAVE_GL_GLX_H 1
| #define HAVE_SDL_SDL_H 1
| #define HAVE_X11_XLIB_H 1
| /* end confdefs.h.  */
| #include <stdio.h>
| #if HAVE_SYS_TYPES_H
| # include <sys/types.h>
| #endif
| #if HAVE_SYS_STAT_H
| # include <sys/stat.h>
| #endif
| #if STDC_HEADERS
| # include <stdlib.h>
| # include <stddef.h>
| #else
| # if HAVE_STDLIB_H
| #  include <stdlib.h>
| # endif
| #endif
| #if HAVE_STRING_H
| # if !STDC_HEADERS && HAVE_MEMORY_H
| #  include <memory.h>
| # endif
| # include <string.h>
| #endif
| #if HAVE_STRINGS_H
| # include <strings.h>
| #endif
| #if HAVE_INTTYPES_H
| # include <inttypes.h>
| #else
| # if HAVE_STDINT_H
| #  include <stdint.h>
| # endif
| #endif
| #if HAVE_UNISTD_H
| # include <unistd.h>
| #endif
| #include <bstring.h>
configure:5265: result: no
configure:5269: checking bstring.h presence
configure:5279: gcc -E  conftest.c
conftest.c:33:21: bstring.h: No such file or directory
configure:5285: $? = 1
configure: failed program was:
| /* confdefs.h.  */
| 
| #define PACKAGE_NAME ""
| #define PACKAGE_TARNAME ""
| #define PACKAGE_VERSION ""
| #define PACKAGE_STRING ""
| #define PACKAGE_BUGREPORT ""
| #define PACKAGE "bzflag"
| #define VERSION "2.0.3.20050830"
| #define BZ_BUILD_OS "linux-gnu"
| #define BZ_BUILD_USER "wili"
| #define BUILD_REGEX 1
| #ifdef __cplusplus
| extern "C" void std::exit (int) throw (); using std::exit;
| #endif
| #define STDC_HEADERS 1
| #define HAVE_SYS_TYPES_H 1
| #define HAVE_SYS_STAT_H 1
| #define HAVE_STDLIB_H 1
| #define HAVE_STRING_H 1
| #define HAVE_MEMORY_H 1
| #define HAVE_STRINGS_H 1
| #define HAVE_INTTYPES_H 1
| #define HAVE_STDINT_H 1
| #define HAVE_UNISTD_H 1
| #define HAVE_CSTDLIB 1
| #define HAVE_CSTDIO 1
| #define HAVE_CSTRING 1
| #define HAVE_GL_GLX_H 1
| #define HAVE_SDL_SDL_H 1
| #define HAVE_X11_XLIB_H 1
| /* end confdefs.h.  */
| #include <bstring.h>
configure:5305: result: no
configure:5340: checking for bstring.h
configure:5347: result: no
configure:5224: checking linux/input.h usability
configure:5236: gcc -c -g -O2  conftest.c >&5
configure:5242: $? = 0
configure:5246: test -z 
			 || test ! -s conftest.err
configure:5249: $? = 0
configure:5252: test -s conftest.o
configure:5255: $? = 0
configure:5265: result: yes
configure:5269: checking linux/input.h presence
configure:5279: gcc -E  conftest.c
configure:5285: $? = 0
configure:5305: result: yes
configure:5340: checking for linux/input.h
configure:5347: result: yes
configure:5215: checking for stdint.h
configure:5220: result: yes
configure:5224: checking sys/param.h usability
configure:5236: gcc -c -g -O2  conftest.c >&5
configure:5242: $? = 0
configure:5246: test -z 
			 || test ! -s conftest.err
configure:5249: $? = 0
configure:5252: test -s conftest.o
configure:5255: $? = 0
configure:5265: result: yes
configure:5269: checking sys/param.h presence
configure:5279: gcc -E  conftest.c
configure:5285: $? = 0
configure:5305: result: yes
configure:5340: checking for sys/param.h
configure:5347: result: yes
configure:5215: checking for unistd.h
configure:5220: result: yes
configure:5224: checking values.h usability
configure:5236: gcc -c -g -O2  conftest.c >&5
configure:5242: $? = 0
configure:5246: test -z 
			 || test ! -s conftest.err
configure:5249: $? = 0
configure:5252: test -s conftest.o
configure:5255: $? = 0
configure:5265: result: yes
configure:5269: checking values.h presence
configure:5279: gcc -E  conftest.c
configure:5285: $? = 0
configure:5305: result: yes
configure:5340: checking for values.h
configure:5347: result: yes
configure:5224: checking dsound.h usability
configure:5236: gcc -c -g -O2  conftest.c >&5
conftest.c:72:20: dsound.h: No such file or directory
configure:5242: $? = 1
configure: failed program was:
| /* confdefs.h.  */
| 
| #define PACKAGE_NAME ""
| #define PACKAGE_TARNAME ""
| #define PACKAGE_VERSION ""
| #define PACKAGE_STRING ""
| #define PACKAGE_BUGREPORT ""
| #define PACKAGE "bzflag"
| #define VERSION "2.0.3.20050830"
| #define BZ_BUILD_OS "linux-gnu"
| #define BZ_BUILD_USER "wili"
| #define BUILD_REGEX 1
| #ifdef __cplusplus
| extern "C" void std::exit (int) throw (); using std::exit;
| #endif
| #define STDC_HEADERS 1
| #define HAVE_SYS_TYPES_H 1
| #define HAVE_SYS_STAT_H 1
| #define HAVE_STDLIB_H 1
| #define HAVE_STRING_H 1
| #define HAVE_MEMORY_H 1
| #define HAVE_STRINGS_H 1
| #define HAVE_INTTYPES_H 1
| #define HAVE_STDINT_H 1
| #define HAVE_UNISTD_H 1
| #define HAVE_CSTDLIB 1
| #define HAVE_CSTDIO 1
| #define HAVE_CSTRING 1
| #define HAVE_GL_GLX_H 1
| #define HAVE_SDL_SDL_H 1
| #define HAVE_X11_XLIB_H 1
| #define HAVE_LINUX_INPUT_H 1
| #define HAVE_STDINT_H 1
| #define HAVE_SYS_PARAM_H 1
| #define HAVE_UNISTD_H 1
| #define HAVE_VALUES_H 1
| /* end confdefs.h.  */
| #include <stdio.h>
| #if HAVE_SYS_TYPES_H
| # include <sys/types.h>
| #endif
| #if HAVE_SYS_STAT_H
| # include <sys/stat.h>
| #endif
| #if STDC_HEADERS
| # include <stdlib.h>
| # include <stddef.h>
| #else
| # if HAVE_STDLIB_H
| #  include <stdlib.h>
| # endif
| #endif
| #if HAVE_STRING_H
| # if !STDC_HEADERS && HAVE_MEMORY_H
| #  include <memory.h>
| # endif
| # include <string.h>
| #endif
| #if HAVE_STRINGS_H
| # include <strings.h>
| #endif
| #if HAVE_INTTYPES_H
| # include <inttypes.h>
| #else
| # if HAVE_STDINT_H
| #  include <stdint.h>
| # endif
| #endif
| #if HAVE_UNISTD_H
| # include <unistd.h>
| #endif
| #include <dsound.h>
configure:5265: result: no
configure:5269: checking dsound.h presence
configure:5279: gcc -E  conftest.c
conftest.c:38:20: dsound.h: No such file or directory
configure:5285: $? = 1
configure: failed program was:
| /* confdefs.h.  */
| 
| #define PACKAGE_NAME ""
| #define PACKAGE_TARNAME ""
| #define PACKAGE_VERSION ""
| #define PACKAGE_STRING ""
| #define PACKAGE_BUGREPORT ""
| #define PACKAGE "bzflag"
| #define VERSION "2.0.3.20050830"
| #define BZ_BUILD_OS "linux-gnu"
| #define BZ_BUILD_USER "wili"
| #define BUILD_REGEX 1
| #ifdef __cplusplus
| extern "C" void std::exit (int) throw (); using std::exit;
| #endif
| #define STDC_HEADERS 1
| #define HAVE_SYS_TYPES_H 1
| #define HAVE_SYS_STAT_H 1
| #define HAVE_STDLIB_H 1
| #define HAVE_STRING_H 1
| #define HAVE_MEMORY_H 1
| #define HAVE_STRINGS_H 1
| #define HAVE_INTTYPES_H 1
| #define HAVE_STDINT_H 1
| #define HAVE_UNISTD_H 1
| #define HAVE_CSTDLIB 1
| #define HAVE_CSTDIO 1
| #define HAVE_CSTRING 1
| #define HAVE_GL_GLX_H 1
| #define HAVE_SDL_SDL_H 1
| #define HAVE_X11_XLIB_H 1
| #define HAVE_LINUX_INPUT_H 1
| #define HAVE_STDINT_H 1
| #define HAVE_SYS_PARAM_H 1
| #define HAVE_UNISTD_H 1
| #define HAVE_VALUES_H 1
| /* end confdefs.h.  */
| #include <dsound.h>
configure:5305: result: no
configure:5340: checking for dsound.h
configure:5347: result: no
configure:5364: checking for an ANSI C-conforming const
configure:5431: gcc -c -g -O2  conftest.c >&5
configure:5437: $? = 0
configure:5441: test -z 
			 || test ! -s conftest.err
configure:5444: $? = 0
configure:5447: test -s conftest.o
configure:5450: $? = 0
configure:5461: result: yes
configure:5472: checking for socklen_t type
configure:5491: gcc -c -g -O2  conftest.c >&5
configure:5497: $? = 0
configure:5501: test -z 
			 || test ! -s conftest.err
configure:5504: $? = 0
configure:5507: test -s conftest.o
configure:5510: $? = 0
configure:5533: result: yes
configure:5537: checking for linux rumble joystick support
configure:5555: gcc -c -g -O2  conftest.c >&5
configure:5561: $? = 0
configure:5565: test -z 
			 || test ! -s conftest.err
configure:5568: $? = 0
configure:5571: test -s conftest.o
configure:5574: $? = 0
configure:5591: result: yes
configure:5595: checking for linux force feedback joystick support
configure:5613: gcc -c -g -O2  conftest.c >&5
configure:5619: $? = 0
configure:5623: test -z 
			 || test ! -s conftest.err
configure:5626: $? = 0
configure:5629: test -s conftest.o
configure:5632: $? = 0
configure:5649: result: yes
configure:5780: checking for X
configure:6010: result: libraries /usr/X11R6/lib, headers /usr/X11R6/include
configure:6182: gcc -o conftest -g -O2   conftest.c -L/usr/lib -lcurl -lidn -lssl -lcrypto -ldl -lssl -lcrypto -ldl -lz   -L/usr/X11R6/lib -lX11 >&5
configure:6188: $? = 0
configure:6192: test -z 
			 || test ! -s conftest.err
configure:6195: $? = 0
configure:6198: test -s conftest
configure:6201: $? = 0
configure:6359: checking for gethostbyname
configure:6416: gcc -o conftest -g -O2   conftest.c -L/usr/lib -lcurl -lidn -lssl -lcrypto -ldl -lssl -lcrypto -ldl -lz  >&5
configure:6422: $? = 0
configure:6426: test -z 
			 || test ! -s conftest.err
configure:6429: $? = 0
configure:6432: test -s conftest
configure:6435: $? = 0
configure:6447: result: yes
configure:6598: checking for connect
configure:6655: gcc -o conftest -g -O2   conftest.c -L/usr/lib -lcurl -lidn -lssl -lcrypto -ldl -lssl -lcrypto -ldl -lz  >&5
configure:6661: $? = 0
configure:6665: test -z 
			 || test ! -s conftest.err
configure:6668: $? = 0
configure:6671: test -s conftest
configure:6674: $? = 0
configure:6686: result: yes
configure:6761: checking for remove
configure:6818: gcc -o conftest -g -O2   conftest.c -L/usr/lib -lcurl -lidn -lssl -lcrypto -ldl -lssl -lcrypto -ldl -lz  >&5
configure:6824: $? = 0
configure:6828: test -z 
			 || test ! -s conftest.err
configure:6831: $? = 0
configure:6834: test -s conftest
configure:6837: $? = 0
configure:6849: result: yes
configure:6924: checking for shmat
configure:6981: gcc -o conftest -g -O2   conftest.c -L/usr/lib -lcurl -lidn -lssl -lcrypto -ldl -lssl -lcrypto -ldl -lz  >&5
configure:6987: $? = 0
configure:6991: test -z 
			 || test ! -s conftest.err
configure:6994: $? = 0
configure:6997: test -s conftest
configure:7000: $? = 0
configure:7012: result: yes
configure:7096: checking for IceConnectionNumber in -lICE
configure:7126: gcc -o conftest -g -O2   -L/usr/X11R6/lib conftest.c -lICE  -L/usr/lib -lcurl -lidn -lssl -lcrypto -ldl -lssl -lcrypto -ldl -lz  >&5
configure:7132: $? = 0
configure:7136: test -z 
			 || test ! -s conftest.err
configure:7139: $? = 0
configure:7142: test -s conftest
configure:7145: $? = 0
configure:7158: result: yes
configure:7192: checking for sqrtf in -lm
configure:7222: gcc -o conftest -g -O2   -I/usr/X11R6/include   -L/usr/X11R6/lib conftest.c -lm  -L/usr/lib -lcurl -lidn -lssl -lcrypto -ldl -lssl -lcrypto -ldl -lz  >&5
conftest.c:48: warning: conflicting types for built-in function 'sqrtf'
configure:7228: $? = 0
configure:7232: test -z 
			 || test ! -s conftest.err
configure:7235: $? = 0
configure:7238: test -s conftest
configure:7241: $? = 0
configure:7254: result: yes
configure:7268: checking for socket in -lsocket
configure:7298: gcc -o conftest -g -O2   -I/usr/X11R6/include   -L/usr/X11R6/lib conftest.c -lsocket  -lm -L/usr/lib -lcurl -lidn -lssl -lcrypto -ldl -lssl -lcrypto -ldl -lz  >&5
/usr/bin/ld: cannot find -lsocket
collect2: ld returned 1 exit status
configure:7304: $? = 1
configure: failed program was:
| /* confdefs.h.  */
| 
| #define PACKAGE_NAME ""
| #define PACKAGE_TARNAME ""
| #define PACKAGE_VERSION ""
| #define PACKAGE_STRING ""
| #define PACKAGE_BUGREPORT ""
| #define PACKAGE "bzflag"
| #define VERSION "2.0.3.20050830"
| #define BZ_BUILD_OS "linux-gnu"
| #define BZ_BUILD_USER "wili"
| #define BUILD_REGEX 1
| #ifdef __cplusplus
| extern "C" void std::exit (int) throw (); using std::exit;
| #endif
| #define STDC_HEADERS 1
| #define HAVE_SYS_TYPES_H 1
| #define HAVE_SYS_STAT_H 1
| #define HAVE_STDLIB_H 1
| #define HAVE_STRING_H 1
| #define HAVE_MEMORY_H 1
| #define HAVE_STRINGS_H 1
| #define HAVE_INTTYPES_H 1
| #define HAVE_STDINT_H 1
| #define HAVE_UNISTD_H 1
| #define HAVE_CSTDLIB 1
| #define HAVE_CSTDIO 1
| #define HAVE_CSTRING 1
| #define HAVE_GL_GLX_H 1
| #define HAVE_SDL_SDL_H 1
| #define HAVE_X11_XLIB_H 1
| #define HAVE_LINUX_INPUT_H 1
| #define HAVE_STDINT_H 1
| #define HAVE_SYS_PARAM_H 1
| #define HAVE_UNISTD_H 1
| #define HAVE_VALUES_H 1
| #define HAVE_SOCKLEN_T 1
| #define HAVE_FF_EFFECT_RUMBLE 1
| #define HAVE_FF_EFFECT_DIRECTIONAL 1
| #define HAVE_LIBM 1
| /* end confdefs.h.  */
| 
| /* Override any gcc2 internal prototype to avoid an error.  */
| #ifdef __cplusplus
| extern "C"
| #endif
| /* We use char because int might match the return type of a gcc2
|    builtin and then its argument prototype would still apply.  */
| char socket ();
| int
| main ()
| {
| socket ();
|   ;
|   return 0;
| }
configure:7330: result: no
configure:7342: checking for gethostent in -lsocket
configure:7372: gcc -o conftest -g -O2   -I/usr/X11R6/include   -L/usr/X11R6/lib conftest.c -lsocket  -lm -L/usr/lib -lcurl -lidn -lssl -lcrypto -ldl -lssl -lcrypto -ldl -lz  >&5
/usr/bin/ld: cannot find -lsocket
collect2: ld returned 1 exit status
configure:7378: $? = 1
configure: failed program was:
| /* confdefs.h.  */
| 
| #define PACKAGE_NAME ""
| #define PACKAGE_TARNAME ""
| #define PACKAGE_VERSION ""
| #define PACKAGE_STRING ""
| #define PACKAGE_BUGREPORT ""
| #define PACKAGE "bzflag"
| #define VERSION "2.0.3.20050830"
| #define BZ_BUILD_OS "linux-gnu"
| #define BZ_BUILD_USER "wili"
| #define BUILD_REGEX 1
| #ifdef __cplusplus
| extern "C" void std::exit (int) throw (); using std::exit;
| #endif
| #define STDC_HEADERS 1
| #define HAVE_SYS_TYPES_H 1
| #define HAVE_SYS_STAT_H 1
| #define HAVE_STDLIB_H 1
| #define HAVE_STRING_H 1
| #define HAVE_MEMORY_H 1
| #define HAVE_STRINGS_H 1
| #define HAVE_INTTYPES_H 1
| #define HAVE_STDINT_H 1
| #define HAVE_UNISTD_H 1
| #define HAVE_CSTDLIB 1
| #define HAVE_CSTDIO 1
| #define HAVE_CSTRING 1
| #define HAVE_GL_GLX_H 1
| #define HAVE_SDL_SDL_H 1
| #define HAVE_X11_XLIB_H 1
| #define HAVE_LINUX_INPUT_H 1
| #define HAVE_STDINT_H 1
| #define HAVE_SYS_PARAM_H 1
| #define HAVE_UNISTD_H 1
| #define HAVE_VALUES_H 1
| #define HAVE_SOCKLEN_T 1
| #define HAVE_FF_EFFECT_RUMBLE 1
| #define HAVE_FF_EFFECT_DIRECTIONAL 1
| #define HAVE_LIBM 1
| /* end confdefs.h.  */
| 
| /* Override any gcc2 internal prototype to avoid an error.  */
| #ifdef __cplusplus
| extern "C"
| #endif
| /* We use char because int might match the return type of a gcc2
|    builtin and then its argument prototype would still apply.  */
| char gethostent ();
| int
| main ()
| {
| gethostent ();
|   ;
|   return 0;
| }
configure:7404: result: no
configure:7415: checking for gethostent in -lbind
configure:7445: gcc -o conftest -g -O2   -I/usr/X11R6/include   -L/usr/X11R6/lib conftest.c -lbind  -lm -L/usr/lib -lcurl -lidn -lssl -lcrypto -ldl -lssl -lcrypto -ldl -lz  >&5
/usr/bin/ld: cannot find -lbind
collect2: ld returned 1 exit status
configure:7451: $? = 1
configure: failed program was:
| /* confdefs.h.  */
| 
| #define PACKAGE_NAME ""
| #define PACKAGE_TARNAME ""
| #define PACKAGE_VERSION ""
| #define PACKAGE_STRING ""
| #define PACKAGE_BUGREPORT ""
| #define PACKAGE "bzflag"
| #define VERSION "2.0.3.20050830"
| #define BZ_BUILD_OS "linux-gnu"
| #define BZ_BUILD_USER "wili"
| #define BUILD_REGEX 1
| #ifdef __cplusplus
| extern "C" void std::exit (int) throw (); using std::exit;
| #endif
| #define STDC_HEADERS 1
| #define HAVE_SYS_TYPES_H 1
| #define HAVE_SYS_STAT_H 1
| #define HAVE_STDLIB_H 1
| #define HAVE_STRING_H 1
| #define HAVE_MEMORY_H 1
| #define HAVE_STRINGS_H 1
| #define HAVE_INTTYPES_H 1
| #define HAVE_STDINT_H 1
| #define HAVE_UNISTD_H 1
| #define HAVE_CSTDLIB 1
| #define HAVE_CSTDIO 1
| #define HAVE_CSTRING 1
| #define HAVE_GL_GLX_H 1
| #define HAVE_SDL_SDL_H 1
| #define HAVE_X11_XLIB_H 1
| #define HAVE_LINUX_INPUT_H 1
| #define HAVE_STDINT_H 1
| #define HAVE_SYS_PARAM_H 1
| #define HAVE_UNISTD_H 1
| #define HAVE_VALUES_H 1
| #define HAVE_SOCKLEN_T 1
| #define HAVE_FF_EFFECT_RUMBLE 1
| #define HAVE_FF_EFFECT_DIRECTIONAL 1
| #define HAVE_LIBM 1
| /* end confdefs.h.  */
| 
| /* Override any gcc2 internal prototype to avoid an error.  */
| #ifdef __cplusplus
| extern "C"
| #endif
| /* We use char because int might match the return type of a gcc2
|    builtin and then its argument prototype would still apply.  */
| char gethostent ();
| int
| main ()
| {
| gethostent ();
|   ;
|   return 0;
| }
configure:7477: result: no
configure:7492: checking for acosf in -lm
configure:7522: gcc -o conftest -g -O2   -I/usr/X11R6/include   -L/usr/X11R6/lib conftest.c -lm  -lm -L/usr/lib -lcurl -lidn -lssl -lcrypto -ldl -lssl -lcrypto -ldl -lz  >&5
conftest.c:49: warning: conflicting types for built-in function 'acosf'
configure:7528: $? = 0
configure:7532: test -z 
			 || test ! -s conftest.err
configure:7535: $? = 0
configure:7538: test -s conftest
configure:7541: $? = 0
configure:7554: result: yes
configure:7564: checking for asinf in -lm
configure:7594: gcc -o conftest -g -O2   -I/usr/X11R6/include   -L/usr/X11R6/lib conftest.c -lm  -lm -L/usr/lib -lcurl -lidn -lssl -lcrypto -ldl -lssl -lcrypto -ldl -lz  >&5
conftest.c:50: warning: conflicting types for built-in function 'asinf'
configure:7600: $? = 0
configure:7604: test -z 
			 || test ! -s conftest.err
configure:7607: $? = 0
configure:7610: test -s conftest
configure:7613: $? = 0
configure:7626: result: yes
configure:7636: checking for atan2f in -lm
configure:7666: gcc -o conftest -g -O2   -I/usr/X11R6/include   -L/usr/X11R6/lib conftest.c -lm  -lm -L/usr/lib -lcurl -lidn -lssl -lcrypto -ldl -lssl -lcrypto -ldl -lz  >&5
conftest.c:51: warning: conflicting types for built-in function 'atan2f'
configure:7672: $? = 0
configure:7676: test -z 
			 || test ! -s conftest.err
configure:7679: $? = 0
configure:7682: test -s conftest
configure:7685: $? = 0
configure:7698: result: yes
configure:7708: checking for atanf in -lm
configure:7738: gcc -o conftest -g -O2   -I/usr/X11R6/include   -L/usr/X11R6/lib conftest.c -lm  -lm -L/usr/lib -lcurl -lidn -lssl -lcrypto -ldl -lssl -lcrypto -ldl -lz  >&5
conftest.c:52: warning: conflicting types for built-in function 'atanf'
configure:7744: $? = 0
configure:7748: test -z 
			 || test ! -s conftest.err
configure:7751: $? = 0
configure:7754: test -s conftest
configure:7757: $? = 0
configure:7770: result: yes
configure:7780: checking for cosf in -lm
configure:7810: gcc -o conftest -g -O2   -I/usr/X11R6/include   -L/usr/X11R6/lib conftest.c -lm  -lm -L/usr/lib -lcurl -lidn -lssl -lcrypto -ldl -lssl -lcrypto -ldl -lz  >&5
conftest.c:53: warning: conflicting types for built-in function 'cosf'
configure:7816: $? = 0
configure:7820: test -z 
			 || test ! -s conftest.err
configure:7823: $? = 0
configure:7826: test -s conftest
configure:7829: $? = 0
configure:7842: result: yes
configure:7852: checking for expf in -lm
configure:7882: gcc -o conftest -g -O2   -I/usr/X11R6/include   -L/usr/X11R6/lib conftest.c -lm  -lm -L/usr/lib -lcurl -lidn -lssl -lcrypto -ldl -lssl -lcrypto -ldl -lz  >&5
conftest.c:54: warning: conflicting types for built-in function 'expf'
configure:7888: $? = 0
configure:7892: test -z 
			 || test ! -s conftest.err
configure:7895: $? = 0
configure:7898: test -s conftest
configure:7901: $? = 0
configure:7914: result: yes
configure:7924: checking for fabsf in -lm
configure:7954: gcc -o conftest -g -O2   -I/usr/X11R6/include   -L/usr/X11R6/lib conftest.c -lm  -lm -L/usr/lib -lcurl -lidn -lssl -lcrypto -ldl -lssl -lcrypto -ldl -lz  >&5
conftest.c:55: warning: conflicting types for built-in function 'fabsf'
configure:7960: $? = 0
configure:7964: test -z 
			 || test ! -s conftest.err
configure:7967: $? = 0
configure:7970: test -s conftest
configure:7973: $? = 0
configure:7986: result: yes
configure:7996: checking for floorf in -lm
configure:8026: gcc -o conftest -g -O2   -I/usr/X11R6/include   -L/usr/X11R6/lib conftest.c -lm  -lm -L/usr/lib -lcurl -lidn -lssl -lcrypto -ldl -lssl -lcrypto -ldl -lz  >&5
conftest.c:56: warning: conflicting types for built-in function 'floorf'
configure:8032: $? = 0
configure:8036: test -z 
			 || test ! -s conftest.err
configure:8039: $? = 0
configure:8042: test -s conftest
configure:8045: $? = 0
configure:8058: result: yes
configure:8068: checking for fmodf in -lm
configure:8098: gcc -o conftest -g -O2   -I/usr/X11R6/include   -L/usr/X11R6/lib conftest.c -lm  -lm -L/usr/lib -lcurl -lidn -lssl -lcrypto -ldl -lssl -lcrypto -ldl -lz  >&5
conftest.c:57: warning: conflicting types for built-in function 'fmodf'
configure:8104: $? = 0
configure:8108: test -z 
			 || test ! -s conftest.err
configure:8111: $? = 0
configure:8114: test -s conftest
configure:8117: $? = 0
configure:8130: result: yes
configure:8140: checking for hypotf in -lm
configure:8170: gcc -o conftest -g -O2   -I/usr/X11R6/include   -L/usr/X11R6/lib conftest.c -lm  -lm -L/usr/lib -lcurl -lidn -lssl -lcrypto -ldl -lssl -lcrypto -ldl -lz  >&5
conftest.c:58: warning: conflicting types for built-in function 'hypotf'
configure:8176: $? = 0
configure:8180: test -z 
			 || test ! -s conftest.err
configure:8183: $? = 0
configure:8186: test -s conftest
configure:8189: $? = 0
configure:8202: result: yes
configure:8212: checking for logf in -lm
configure:8242: gcc -o conftest -g -O2   -I/usr/X11R6/include   -L/usr/X11R6/lib conftest.c -lm  -lm -L/usr/lib -lcurl -lidn -lssl -lcrypto -ldl -lssl -lcrypto -ldl -lz  >&5
conftest.c:59: warning: conflicting types for built-in function 'logf'
configure:8248: $? = 0
configure:8252: test -z 
			 || test ! -s conftest.err
configure:8255: $? = 0
configure:8258: test -s conftest
configure:8261: $? = 0
configure:8274: result: yes
configure:8284: checking for powf in -lm
configure:8314: gcc -o conftest -g -O2   -I/usr/X11R6/include   -L/usr/X11R6/lib conftest.c -lm  -lm -L/usr/lib -lcurl -lidn -lssl -lcrypto -ldl -lssl -lcrypto -ldl -lz  >&5
conftest.c:60: warning: conflicting types for built-in function 'powf'
configure:8320: $? = 0
configure:8324: test -z 
			 || test ! -s conftest.err
configure:8327: $? = 0
configure:8330: test -s conftest
configure:8333: $? = 0
configure:8346: result: yes
configure:8356: checking for sinf in -lm
configure:8386: gcc -o conftest -g -O2   -I/usr/X11R6/include   -L/usr/X11R6/lib conftest.c -lm  -lm -L/usr/lib -lcurl -lidn -lssl -lcrypto -ldl -lssl -lcrypto -ldl -lz  >&5
conftest.c:61: warning: conflicting types for built-in function 'sinf'
configure:8392: $? = 0
configure:8396: test -z 
			 || test ! -s conftest.err
configure:8399: $? = 0
configure:8402: test -s conftest
configure:8405: $? = 0
configure:8418: result: yes
configure:8428: checking for sqrtf in -lm
configure:8490: result: yes
configure:8500: checking for tanf in -lm
configure:8530: gcc -o conftest -g -O2   -I/usr/X11R6/include   -L/usr/X11R6/lib conftest.c -lm  -lm -L/usr/lib -lcurl -lidn -lssl -lcrypto -ldl -lssl -lcrypto -ldl -lz  >&5
conftest.c:63: warning: conflicting types for built-in function 'tanf'
configure:8536: $? = 0
configure:8540: test -z 
			 || test ! -s conftest.err
configure:8543: $? = 0
configure:8546: test -s conftest
configure:8549: $? = 0
configure:8562: result: yes
configure:8585: checking for XextAddDisplay in -lXext
configure:8615: gcc -o conftest -g -O2   -I/usr/X11R6/include   -L/usr/X11R6/lib conftest.c -lXext  -lSM -lICE -lX11   -lm -L/usr/lib -lcurl -lidn -lssl -lcrypto -ldl -lssl -lcrypto -ldl -lz  >&5
configure:8621: $? = 0
configure:8625: test -z 
			 || test ! -s conftest.err
configure:8628: $? = 0
configure:8631: test -s conftest
configure:8634: $? = 0
configure:8647: result: yes
configure:8655: checking for XF86VidModeGetAllModeLines in -lXxf86vm
configure:8685: gcc -o conftest -g -O2   -I/usr/X11R6/include   -L/usr/X11R6/lib conftest.c -lXxf86vm -lXext  -lSM -lICE -lX11   -lm -L/usr/lib -lcurl -lidn -lssl -lcrypto -ldl -lssl -lcrypto -ldl -lz  >&5
configure:8691: $? = 0
configure:8695: test -z 
			 || test ! -s conftest.err
configure:8698: $? = 0
configure:8701: test -s conftest
configure:8704: $? = 0
configure:8717: result: yes
configure:8723: checking for XListInputDevices in -lXi
configure:8753: gcc -o conftest -g -O2   -I/usr/X11R6/include   -L/usr/X11R6/lib conftest.c -lXi -lXxf86vm -lXext  -lSM -lICE -lX11   -lm -L/usr/lib -lcurl -lidn -lssl -lcrypto -ldl -lssl -lcrypto -ldl -lz  >&5
configure:8759: $? = 0
configure:8763: test -z 
			 || test ! -s conftest.err
configure:8766: $? = 0
configure:8769: test -s conftest
configure:8772: $? = 0
configure:8785: result: yes
configure:8824: g++ -o conftest -g -O2   -I/usr/X11R6/include   -L/usr/X11R6/lib conftest.cc -lm -L/usr/lib -lcurl -lidn -lssl -lcrypto -ldl -lssl -lcrypto -ldl -lz  >&5
configure:8830: $? = 0
configure:8834: test -z 
			 || test ! -s conftest.err
configure:8837: $? = 0
configure:8840: test -s conftest
configure:8843: $? = 0
configure:8879: g++ -c -g -O2   -I/usr/X11R6/include conftest.cc >&5
configure:8885: $? = 0
configure:8889: test -z 
			 || test ! -s conftest.err
configure:8892: $? = 0
configure:8895: test -s conftest.o
configure:8898: $? = 0
configure:8933: g++ -o conftest -g -O2   -I/usr/X11R6/include   -L/usr/X11R6/lib conftest.cc -framework OpenGL -lXi -lXxf86vm -lXext  -lSM -lICE -lX11   -lm -L/usr/lib -lcurl -lidn -lssl -lcrypto -ldl -lssl -lcrypto -ldl -lz  >&5
g++: OpenGL: No such file or directory
cc1plus: error: unrecognized command line option "-framework"
configure:8939: $? = 1
configure: failed program was:
| /* confdefs.h.  */
| 
| #define PACKAGE_NAME ""
| #define PACKAGE_TARNAME ""
| #define PACKAGE_VERSION ""
| #define PACKAGE_STRING ""
| #define PACKAGE_BUGREPORT ""
| #define PACKAGE "bzflag"
| #define VERSION "2.0.3.20050830"
| #define BZ_BUILD_OS "linux-gnu"
| #define BZ_BUILD_USER "wili"
| #define BUILD_REGEX 1
| #ifdef __cplusplus
| extern "C" void std::exit (int) throw (); using std::exit;
| #endif
| #define STDC_HEADERS 1
| #define HAVE_SYS_TYPES_H 1
| #define HAVE_SYS_STAT_H 1
| #define HAVE_STDLIB_H 1
| #define HAVE_STRING_H 1
| #define HAVE_MEMORY_H 1
| #define HAVE_STRINGS_H 1
| #define HAVE_INTTYPES_H 1
| #define HAVE_STDINT_H 1
| #define HAVE_UNISTD_H 1
| #define HAVE_CSTDLIB 1
| #define HAVE_CSTDIO 1
| #define HAVE_CSTRING 1
| #define HAVE_GL_GLX_H 1
| #define HAVE_SDL_SDL_H 1
| #define HAVE_X11_XLIB_H 1
| #define HAVE_LINUX_INPUT_H 1
| #define HAVE_STDINT_H 1
| #define HAVE_SYS_PARAM_H 1
| #define HAVE_UNISTD_H 1
| #define HAVE_VALUES_H 1
| #define HAVE_SOCKLEN_T 1
| #define HAVE_FF_EFFECT_RUMBLE 1
| #define HAVE_FF_EFFECT_DIRECTIONAL 1
| #define HAVE_LIBM 1
| #define HAVE_ACOSF 1
| #define HAVE_ASINF 1
| #define HAVE_ATAN2F 1
| #define HAVE_ATANF 1
| #define HAVE_COSF 1
| #define HAVE_EXPF 1
| #define HAVE_FABSF 1
| #define HAVE_FLOORF 1
| #define HAVE_FMODF 1
| #define HAVE_HYPOTF 1
| #define HAVE_LOGF 1
| #define HAVE_POWF 1
| #define HAVE_SINF 1
| #define HAVE_SQRTF 1
| #define HAVE_TANF 1
| #define HAVE_REGEX_H 1
| #define HAVE_STD_COUNT 1
| /* end confdefs.h.  */
| #include <OpenGL/gl.h>
| int
| main ()
| {
| glBegin(GL_POINTS)
|   ;
|   return 0;
| }
configure:8980: g++ -o conftest -g -O2   -I/usr/X11R6/include   -L/usr/X11R6/lib conftest.cc -lopengl32 -lXi -lXxf86vm -lXext  -lSM -lICE -lX11   -lm -L/usr/lib -lcurl -lidn -lssl -lcrypto -ldl -lssl -lcrypto -ldl -lz  >&5
/usr/bin/ld: cannot find -lopengl32
collect2: ld returned 1 exit status
configure:8986: $? = 1
configure: failed program was:
| /* confdefs.h.  */
| 
| #define PACKAGE_NAME ""
| #define PACKAGE_TARNAME ""
| #define PACKAGE_VERSION ""
| #define PACKAGE_STRING ""
| #define PACKAGE_BUGREPORT ""
| #define PACKAGE "bzflag"
| #define VERSION "2.0.3.20050830"
| #define BZ_BUILD_OS "linux-gnu"
| #define BZ_BUILD_USER "wili"
| #define BUILD_REGEX 1
| #ifdef __cplusplus
| extern "C" void std::exit (int) throw (); using std::exit;
| #endif
| #define STDC_HEADERS 1
| #define HAVE_SYS_TYPES_H 1
| #define HAVE_SYS_STAT_H 1
| #define HAVE_STDLIB_H 1
| #define HAVE_STRING_H 1
| #define HAVE_MEMORY_H 1
| #define HAVE_STRINGS_H 1
| #define HAVE_INTTYPES_H 1
| #define HAVE_STDINT_H 1
| #define HAVE_UNISTD_H 1
| #define HAVE_CSTDLIB 1
| #define HAVE_CSTDIO 1
| #define HAVE_CSTRING 1
| #define HAVE_GL_GLX_H 1
| #define HAVE_SDL_SDL_H 1
| #define HAVE_X11_XLIB_H 1
| #define HAVE_LINUX_INPUT_H 1
| #define HAVE_STDINT_H 1
| #define HAVE_SYS_PARAM_H 1
| #define HAVE_UNISTD_H 1
| #define HAVE_VALUES_H 1
| #define HAVE_SOCKLEN_T 1
| #define HAVE_FF_EFFECT_RUMBLE 1
| #define HAVE_FF_EFFECT_DIRECTIONAL 1
| #define HAVE_LIBM 1
| #define HAVE_ACOSF 1
| #define HAVE_ASINF 1
| #define HAVE_ATAN2F 1
| #define HAVE_ATANF 1
| #define HAVE_COSF 1
| #define HAVE_EXPF 1
| #define HAVE_FABSF 1
| #define HAVE_FLOORF 1
| #define HAVE_FMODF 1
| #define HAVE_HYPOTF 1
| #define HAVE_LOGF 1
| #define HAVE_POWF 1
| #define HAVE_SINF 1
| #define HAVE_SQRTF 1
| #define HAVE_TANF 1
| #define HAVE_REGEX_H 1
| #define HAVE_STD_COUNT 1
| /* end confdefs.h.  */
| #include <GL/gl.h>
| int
| main ()
| {
| glBegin(GL_POINTS)
|   ;
|   return 0;
| }
configure:8980: g++ -o conftest -g -O2   -I/usr/X11R6/include   -L/usr/X11R6/lib conftest.cc -lGL -lXi -lXxf86vm -lXext  -lSM -lICE -lX11   -lm -L/usr/lib -lcurl -lidn -lssl -lcrypto -ldl -lssl -lcrypto -ldl -lz  >&5
configure:8986: $? = 0
configure:8990: test -z 
			 || test ! -s conftest.err
configure:8993: $? = 0
configure:8996: test -s conftest
configure:8999: $? = 0
configure:9038: g++ -o conftest -g -O2   -I/usr/X11R6/include   -L/usr/X11R6/lib conftest.cc -framework OpenGL -lm -L/usr/lib -lcurl -lidn -lssl -lcrypto -ldl -lssl -lcrypto -ldl -lz  >&5
g++: OpenGL: No such file or directory
cc1plus: error: unrecognized command line option "-framework"
configure:9044: $? = 1
configure: failed program was:
| /* confdefs.h.  */
| 
| #define PACKAGE_NAME ""
| #define PACKAGE_TARNAME ""
| #define PACKAGE_VERSION ""
| #define PACKAGE_STRING ""
| #define PACKAGE_BUGREPORT ""
| #define PACKAGE "bzflag"
| #define VERSION "2.0.3.20050830"
| #define BZ_BUILD_OS "linux-gnu"
| #define BZ_BUILD_USER "wili"
| #define BUILD_REGEX 1
| #ifdef __cplusplus
| extern "C" void std::exit (int) throw (); using std::exit;
| #endif
| #define STDC_HEADERS 1
| #define HAVE_SYS_TYPES_H 1
| #define HAVE_SYS_STAT_H 1
| #define HAVE_STDLIB_H 1
| #define HAVE_STRING_H 1
| #define HAVE_MEMORY_H 1
| #define HAVE_STRINGS_H 1
| #define HAVE_INTTYPES_H 1
| #define HAVE_STDINT_H 1
| #define HAVE_UNISTD_H 1
| #define HAVE_CSTDLIB 1
| #define HAVE_CSTDIO 1
| #define HAVE_CSTRING 1
| #define HAVE_GL_GLX_H 1
| #define HAVE_SDL_SDL_H 1
| #define HAVE_X11_XLIB_H 1
| #define HAVE_LINUX_INPUT_H 1
| #define HAVE_STDINT_H 1
| #define HAVE_SYS_PARAM_H 1
| #define HAVE_UNISTD_H 1
| #define HAVE_VALUES_H 1
| #define HAVE_SOCKLEN_T 1
| #define HAVE_FF_EFFECT_RUMBLE 1
| #define HAVE_FF_EFFECT_DIRECTIONAL 1
| #define HAVE_LIBM 1
| #define HAVE_ACOSF 1
| #define HAVE_ASINF 1
| #define HAVE_ATAN2F 1
| #define HAVE_ATANF 1
| #define HAVE_COSF 1
| #define HAVE_EXPF 1
| #define HAVE_FABSF 1
| #define HAVE_FLOORF 1
| #define HAVE_FMODF 1
| #define HAVE_HYPOTF 1
| #define HAVE_LOGF 1
| #define HAVE_POWF 1
| #define HAVE_SINF 1
| #define HAVE_SQRTF 1
| #define HAVE_TANF 1
| #define HAVE_REGEX_H 1
| #define HAVE_STD_COUNT 1
| /* end confdefs.h.  */
| #include <OpenGL/glu.h>
| int
| main ()
| {
| gluScaleImage(GL_RED,0,0,GL_INT,0,0,0,GL_INT,0)
|   ;
|   return 0;
| }
configure:9085: g++ -o conftest -g -O2   -I/usr/X11R6/include   -L/usr/X11R6/lib conftest.cc -lglu32 -lGL -lXi -lXxf86vm -lXext  -lSM -lICE -lX11   -lm -L/usr/lib -lcurl -lidn -lssl -lcrypto -ldl -lssl -lcrypto -ldl -lz  >&5
conftest.cc:59:20: GL/glu.h: No such file or directory
conftest.cc: In function `int main()':
conftest.cc:63: error: `GL_RED' undeclared (first use this function)
conftest.cc:63: error: (Each undeclared identifier is reported only once for each function it appears in.)
conftest.cc:63: error: `GL_INT' undeclared (first use this function)
conftest.cc:63: error: `gluScaleImage' undeclared (first use this function)
configure:9091: $? = 1
configure: failed program was:
| /* confdefs.h.  */
| 
| #define PACKAGE_NAME ""
| #define PACKAGE_TARNAME ""
| #define PACKAGE_VERSION ""
| #define PACKAGE_STRING ""
| #define PACKAGE_BUGREPORT ""
| #define PACKAGE "bzflag"
| #define VERSION "2.0.3.20050830"
| #define BZ_BUILD_OS "linux-gnu"
| #define BZ_BUILD_USER "wili"
| #define BUILD_REGEX 1
| #ifdef __cplusplus
| extern "C" void std::exit (int) throw (); using std::exit;
| #endif
| #define STDC_HEADERS 1
| #define HAVE_SYS_TYPES_H 1
| #define HAVE_SYS_STAT_H 1
| #define HAVE_STDLIB_H 1
| #define HAVE_STRING_H 1
| #define HAVE_MEMORY_H 1
| #define HAVE_STRINGS_H 1
| #define HAVE_INTTYPES_H 1
| #define HAVE_STDINT_H 1
| #define HAVE_UNISTD_H 1
| #define HAVE_CSTDLIB 1
| #define HAVE_CSTDIO 1
| #define HAVE_CSTRING 1
| #define HAVE_GL_GLX_H 1
| #define HAVE_SDL_SDL_H 1
| #define HAVE_X11_XLIB_H 1
| #define HAVE_LINUX_INPUT_H 1
| #define HAVE_STDINT_H 1
| #define HAVE_SYS_PARAM_H 1
| #define HAVE_UNISTD_H 1
| #define HAVE_VALUES_H 1
| #define HAVE_SOCKLEN_T 1
| #define HAVE_FF_EFFECT_RUMBLE 1
| #define HAVE_FF_EFFECT_DIRECTIONAL 1
| #define HAVE_LIBM 1
| #define HAVE_ACOSF 1
| #define HAVE_ASINF 1
| #define HAVE_ATAN2F 1
| #define HAVE_ATANF 1
| #define HAVE_COSF 1
| #define HAVE_EXPF 1
| #define HAVE_FABSF 1
| #define HAVE_FLOORF 1
| #define HAVE_FMODF 1
| #define HAVE_HYPOTF 1
| #define HAVE_LOGF 1
| #define HAVE_POWF 1
| #define HAVE_SINF 1
| #define HAVE_SQRTF 1
| #define HAVE_TANF 1
| #define HAVE_REGEX_H 1
| #define HAVE_STD_COUNT 1
| /* end confdefs.h.  */
| #include <GL/glu.h>
| int
| main ()
| {
| gluScaleImage(GL_RED,0,0,GL_INT,0,0,0,GL_INT,0)
|   ;
|   return 0;
| }
configure:9085: g++ -o conftest -g -O2   -I/usr/X11R6/include   -L/usr/X11R6/lib conftest.cc -lGL -lGL -lXi -lXxf86vm -lXext  -lSM -lICE -lX11   -lm -L/usr/lib -lcurl -lidn -lssl -lcrypto -ldl -lssl -lcrypto -ldl -lz  >&5
conftest.cc:59:20: GL/glu.h: No such file or directory
conftest.cc: In function `int main()':
conftest.cc:63: error: `GL_RED' undeclared (first use this function)
conftest.cc:63: error: (Each undeclared identifier is reported only once for each function it appears in.)
conftest.cc:63: error: `GL_INT' undeclared (first use this function)
conftest.cc:63: error: `gluScaleImage' undeclared (first use this function)
configure:9091: $? = 1
configure: failed program was:
| /* confdefs.h.  */
| 
| #define PACKAGE_NAME ""
| #define PACKAGE_TARNAME ""
| #define PACKAGE_VERSION ""
| #define PACKAGE_STRING ""
| #define PACKAGE_BUGREPORT ""
| #define PACKAGE "bzflag"
| #define VERSION "2.0.3.20050830"
| #define BZ_BUILD_OS "linux-gnu"
| #define BZ_BUILD_USER "wili"
| #define BUILD_REGEX 1
| #ifdef __cplusplus
| extern "C" void std::exit (int) throw (); using std::exit;
| #endif
| #define STDC_HEADERS 1
| #define HAVE_SYS_TYPES_H 1
| #define HAVE_SYS_STAT_H 1
| #define HAVE_STDLIB_H 1
| #define HAVE_STRING_H 1
| #define HAVE_MEMORY_H 1
| #define HAVE_STRINGS_H 1
| #define HAVE_INTTYPES_H 1
| #define HAVE_STDINT_H 1
| #define HAVE_UNISTD_H 1
| #define HAVE_CSTDLIB 1
| #define HAVE_CSTDIO 1
| #define HAVE_CSTRING 1
| #define HAVE_GL_GLX_H 1
| #define HAVE_SDL_SDL_H 1
| #define HAVE_X11_XLIB_H 1
| #define HAVE_LINUX_INPUT_H 1
| #define HAVE_STDINT_H 1
| #define HAVE_SYS_PARAM_H 1
| #define HAVE_UNISTD_H 1
| #define HAVE_VALUES_H 1
| #define HAVE_SOCKLEN_T 1
| #define HAVE_FF_EFFECT_RUMBLE 1
| #define HAVE_FF_EFFECT_DIRECTIONAL 1
| #define HAVE_LIBM 1
| #define HAVE_ACOSF 1
| #define HAVE_ASINF 1
| #define HAVE_ATAN2F 1
| #define HAVE_ATANF 1
| #define HAVE_COSF 1
| #define HAVE_EXPF 1
| #define HAVE_FABSF 1
| #define HAVE_FLOORF 1
| #define HAVE_FMODF 1
| #define HAVE_HYPOTF 1
| #define HAVE_LOGF 1
| #define HAVE_POWF 1
| #define HAVE_SINF 1
| #define HAVE_SQRTF 1
| #define HAVE_TANF 1
| #define HAVE_REGEX_H 1
| #define HAVE_STD_COUNT 1
| /* end confdefs.h.  */
| #include <GL/glu.h>
| int
| main ()
| {
| gluScaleImage(GL_RED,0,0,GL_INT,0,0,0,GL_INT,0)
|   ;
|   return 0;
| }
configure:9085: g++ -o conftest -g -O2   -I/usr/X11R6/include   -L/usr/X11R6/lib conftest.cc -lGLU -lGL -lXi -lXxf86vm -lXext  -lSM -lICE -lX11   -lm -L/usr/lib -lcurl -lidn -lssl -lcrypto -ldl -lssl -lcrypto -ldl -lz  >&5
conftest.cc:59:20: GL/glu.h: No such file or directory
conftest.cc: In function `int main()':
conftest.cc:63: error: `GL_RED' undeclared (first use this function)
conftest.cc:63: error: (Each undeclared identifier is reported only once for each function it appears in.)
conftest.cc:63: error: `GL_INT' undeclared (first use this function)
conftest.cc:63: error: `gluScaleImage' undeclared (first use this function)
configure:9091: $? = 1
configure: failed program was:
| /* confdefs.h.  */
| 
| #define PACKAGE_NAME ""
| #define PACKAGE_TARNAME ""
| #define PACKAGE_VERSION ""
| #define PACKAGE_STRING ""
| #define PACKAGE_BUGREPORT ""
| #define PACKAGE "bzflag"
| #define VERSION "2.0.3.20050830"
| #define BZ_BUILD_OS "linux-gnu"
| #define BZ_BUILD_USER "wili"
| #define BUILD_REGEX 1
| #ifdef __cplusplus
| extern "C" void std::exit (int) throw (); using std::exit;
| #endif
| #define STDC_HEADERS 1
| #define HAVE_SYS_TYPES_H 1
| #define HAVE_SYS_STAT_H 1
| #define HAVE_STDLIB_H 1
| #define HAVE_STRING_H 1
| #define HAVE_MEMORY_H 1
| #define HAVE_STRINGS_H 1
| #define HAVE_INTTYPES_H 1
| #define HAVE_STDINT_H 1
| #define HAVE_UNISTD_H 1
| #define HAVE_CSTDLIB 1
| #define HAVE_CSTDIO 1
| #define HAVE_CSTRING 1
| #define HAVE_GL_GLX_H 1
| #define HAVE_SDL_SDL_H 1
| #define HAVE_X11_XLIB_H 1
| #define HAVE_LINUX_INPUT_H 1
| #define HAVE_STDINT_H 1
| #define HAVE_SYS_PARAM_H 1
| #define HAVE_UNISTD_H 1
| #define HAVE_VALUES_H 1
| #define HAVE_SOCKLEN_T 1
| #define HAVE_FF_EFFECT_RUMBLE 1
| #define HAVE_FF_EFFECT_DIRECTIONAL 1
| #define HAVE_LIBM 1
| #define HAVE_ACOSF 1
| #define HAVE_ASINF 1
| #define HAVE_ATAN2F 1
| #define HAVE_ATANF 1
| #define HAVE_COSF 1
| #define HAVE_EXPF 1
| #define HAVE_FABSF 1
| #define HAVE_FLOORF 1
| #define HAVE_FMODF 1
| #define HAVE_HYPOTF 1
| #define HAVE_LOGF 1
| #define HAVE_POWF 1
| #define HAVE_SINF 1
| #define HAVE_SQRTF 1
| #define HAVE_TANF 1
| #define HAVE_REGEX_H 1
| #define HAVE_STD_COUNT 1
| /* end confdefs.h.  */
| #include <GL/glu.h>
| int
| main ()
| {
| gluScaleImage(GL_RED,0,0,GL_INT,0,0,0,GL_INT,0)
|   ;
|   return 0;
| }
configure:9399: checking for ares_init in -lcares
configure:9429: g++ -o conftest -g -O2   -I/usr/X11R6/include   -L/usr/X11R6/lib conftest.cc -lcares  -lm -L/usr/lib -lcurl -lidn -lssl -lcrypto -ldl -lssl -lcrypto -ldl -lz  >&5
/usr/bin/ld: cannot find -lcares
collect2: ld returned 1 exit status
configure:9435: $? = 1
configure: failed program was:
| /* confdefs.h.  */
| 
| #define PACKAGE_NAME ""
| #define PACKAGE_TARNAME ""
| #define PACKAGE_VERSION ""
| #define PACKAGE_STRING ""
| #define PACKAGE_BUGREPORT ""
| #define PACKAGE "bzflag"
| #define VERSION "2.0.3.20050830"
| #define BZ_BUILD_OS "linux-gnu"
| #define BZ_BUILD_USER "wili"
| #define BUILD_REGEX 1
| #ifdef __cplusplus
| extern "C" void std::exit (int) throw (); using std::exit;
| #endif
| #define STDC_HEADERS 1
| #define HAVE_SYS_TYPES_H 1
| #define HAVE_SYS_STAT_H 1
| #define HAVE_STDLIB_H 1
| #define HAVE_STRING_H 1
| #define HAVE_MEMORY_H 1
| #define HAVE_STRINGS_H 1
| #define HAVE_INTTYPES_H 1
| #define HAVE_STDINT_H 1
| #define HAVE_UNISTD_H 1
| #define HAVE_CSTDLIB 1
| #define HAVE_CSTDIO 1
| #define HAVE_CSTRING 1
| #define HAVE_GL_GLX_H 1
| #define HAVE_SDL_SDL_H 1
| #define HAVE_X11_XLIB_H 1
| #define HAVE_LINUX_INPUT_H 1
| #define HAVE_STDINT_H 1
| #define HAVE_SYS_PARAM_H 1
| #define HAVE_UNISTD_H 1
| #define HAVE_VALUES_H 1
| #define HAVE_SOCKLEN_T 1
| #define HAVE_FF_EFFECT_RUMBLE 1
| #define HAVE_FF_EFFECT_DIRECTIONAL 1
| #define HAVE_LIBM 1
| #define HAVE_ACOSF 1
| #define HAVE_ASINF 1
| #define HAVE_ATAN2F 1
| #define HAVE_ATANF 1
| #define HAVE_COSF 1
| #define HAVE_EXPF 1
| #define HAVE_FABSF 1
| #define HAVE_FLOORF 1
| #define HAVE_FMODF 1
| #define HAVE_HYPOTF 1
| #define HAVE_LOGF 1
| #define HAVE_POWF 1
| #define HAVE_SINF 1
| #define HAVE_SQRTF 1
| #define HAVE_TANF 1
| #define HAVE_REGEX_H 1
| #define HAVE_STD_COUNT 1
| #define _USE_BZ_API 1
| /* end confdefs.h.  */
| 
| /* Override any gcc2 internal prototype to avoid an error.  */
| #ifdef __cplusplus
| extern "C"
| #endif
| /* We use char because int might match the return type of a gcc2
|    builtin and then its argument prototype would still apply.  */
| char ares_init ();
| int
| main ()
| {
| ares_init ();
|   ;
|   return 0;
| }
configure:9461: result: no
configure:9480: WARNING: using an internal c-ares lib.
configure:9482: WARNING: Consider installing an updated library at system level
configure:9484: WARNING: link is http://daniel.haxx.se/projects/c-ares/
configure:9512: checking for working ncurses
configure:9537: g++ -o conftest -g -O2   -I/usr/X11R6/include   -L/usr/X11R6/lib conftest.cc -lm -L/usr/lib -lcurl -lidn -lssl -lcrypto -ldl -lssl -lcrypto -ldl -lz  -lncurses >&5
configure:9543: $? = 0
configure:9547: test -z 
			 || test ! -s conftest.err
configure:9550: $? = 0
configure:9553: test -s conftest
configure:9556: $? = 0
configure:9568: result: yes
configure:9855: checking for SDL framework
configure:9876: gcc -o conftest -g -O2   -I/usr/X11R6/include   -L/usr/X11R6/lib -framework SDL conftest.c -lGL -lXi -lXxf86vm -lXext  -lSM -lICE -lX11   -lm -L/usr/lib -lcurl -lidn -lssl -lcrypto -ldl -lssl -lcrypto -ldl -lz  >&5
gcc: SDL: No such file or directory
cc1: error: unrecognized command line option "-framework"
configure:9882: $? = 1
configure: failed program was:
| /* confdefs.h.  */
| 
| #define PACKAGE_NAME ""
| #define PACKAGE_TARNAME ""
| #define PACKAGE_VERSION ""
| #define PACKAGE_STRING ""
| #define PACKAGE_BUGREPORT ""
| #define PACKAGE "bzflag"
| #define VERSION "2.0.3.20050830"
| #define BZ_BUILD_OS "linux-gnu"
| #define BZ_BUILD_USER "wili"
| #define BUILD_REGEX 1
| #ifdef __cplusplus
| extern "C" void std::exit (int) throw (); using std::exit;
| #endif
| #define STDC_HEADERS 1
| #define HAVE_SYS_TYPES_H 1
| #define HAVE_SYS_STAT_H 1
| #define HAVE_STDLIB_H 1
| #define HAVE_STRING_H 1
| #define HAVE_MEMORY_H 1
| #define HAVE_STRINGS_H 1
| #define HAVE_INTTYPES_H 1
| #define HAVE_STDINT_H 1
| #define HAVE_UNISTD_H 1
| #define HAVE_CSTDLIB 1
| #define HAVE_CSTDIO 1
| #define HAVE_CSTRING 1
| #define HAVE_GL_GLX_H 1
| #define HAVE_SDL_SDL_H 1
| #define HAVE_X11_XLIB_H 1
| #define HAVE_LINUX_INPUT_H 1
| #define HAVE_STDINT_H 1
| #define HAVE_SYS_PARAM_H 1
| #define HAVE_UNISTD_H 1
| #define HAVE_VALUES_H 1
| #define HAVE_SOCKLEN_T 1
| #define HAVE_FF_EFFECT_RUMBLE 1
| #define HAVE_FF_EFFECT_DIRECTIONAL 1
| #define HAVE_LIBM 1
| #define HAVE_ACOSF 1
| #define HAVE_ASINF 1
| #define HAVE_ATAN2F 1
| #define HAVE_ATANF 1
| #define HAVE_COSF 1
| #define HAVE_EXPF 1
| #define HAVE_FABSF 1
| #define HAVE_FLOORF 1
| #define HAVE_FMODF 1
| #define HAVE_HYPOTF 1
| #define HAVE_LOGF 1
| #define HAVE_POWF 1
| #define HAVE_SINF 1
| #define HAVE_SQRTF 1
| #define HAVE_TANF 1
| #define HAVE_REGEX_H 1
| #define HAVE_STD_COUNT 1
| #define _USE_BZ_API 1
| #define HAVE_NCURSES_H
| /* end confdefs.h.  */
| #include <SDL/SDL_version.h>
| int
| main ()
| {
| 
|   ;
|   return 0;
| }
configure:9906: result: no
configure:9955: checking for sdl-config
configure:9973: found /usr/local/bin/sdl-config
configure:9986: result: /usr/local/bin/sdl-config
configure:9994: checking for SDL - version >= 1.2.5
configure:10086: gcc -o conftest -g -O2 -I/usr/local/include/SDL -D_REENTRANT   -I/usr/X11R6/include   -L/usr/X11R6/lib conftest.c -lGL -lXi -lXxf86vm -lXext  -lSM -lICE -lX11   -lm -L/usr/lib -lcurl -lidn -lssl -lcrypto -ldl -lssl -lcrypto -ldl -lz  -L/usr/local/lib -Wl,-rpath,/usr/local/lib -lSDL -lpthread >&5
configure:10089: $? = 0
configure:10091: ./conftest
configure:10094: $? = 0
configure:10113: result: yes
configure:10279: WARNING: Client build has been requested, but GL is not fully available (missing gl.h)
     ... disabling client generation
configure:10506: checking if the compiler understands -Wl,-search_paths_first -mdynamic-no-pic
configure:10527: g++ -o conftest -g -O2 -DBZ_BUILD_DATE=20050830 -ffast-math -fno-exceptions -fsigned-char   -I/usr/X11R6/include -Wall -W -Wshadow -mtune=i686   -L/usr/X11R6/lib -Wl,-search_paths_first -mdynamic-no-pic conftest.cc -lm -L/usr/lib -lcurl -lidn -lssl -lcrypto -ldl -lssl -lcrypto -ldl -lz  >&5
cc1plus: error: invalid option `dynamic-no-pic'
configure:10533: $? = 1
configure: failed program was:
| /* confdefs.h.  */
| 
| #define PACKAGE_NAME ""
| #define PACKAGE_TARNAME ""
| #define PACKAGE_VERSION ""
| #define PACKAGE_STRING ""
| #define PACKAGE_BUGREPORT ""
| #define PACKAGE "bzflag"
| #define VERSION "2.0.3.20050830"
| #define BZ_BUILD_OS "linux-gnu"
| #define BZ_BUILD_USER "wili"
| #define BUILD_REGEX 1
| #ifdef __cplusplus
| extern "C" void std::exit (int) throw (); using std::exit;
| #endif
| #define STDC_HEADERS 1
| #define HAVE_SYS_TYPES_H 1
| #define HAVE_SYS_STAT_H 1
| #define HAVE_STDLIB_H 1
| #define HAVE_STRING_H 1
| #define HAVE_MEMORY_H 1
| #define HAVE_STRINGS_H 1
| #define HAVE_INTTYPES_H 1
| #define HAVE_STDINT_H 1
| #define HAVE_UNISTD_H 1
| #define HAVE_CSTDLIB 1
| #define HAVE_CSTDIO 1
| #define HAVE_CSTRING 1
| #define HAVE_GL_GLX_H 1
| #define HAVE_SDL_SDL_H 1
| #define HAVE_X11_XLIB_H 1
| #define HAVE_LINUX_INPUT_H 1
| #define HAVE_STDINT_H 1
| #define HAVE_SYS_PARAM_H 1
| #define HAVE_UNISTD_H 1
| #define HAVE_VALUES_H 1
| #define HAVE_SOCKLEN_T 1
| #define HAVE_FF_EFFECT_RUMBLE 1
| #define HAVE_FF_EFFECT_DIRECTIONAL 1
| #define HAVE_LIBM 1
| #define HAVE_ACOSF 1
| #define HAVE_ASINF 1
| #define HAVE_ATAN2F 1
| #define HAVE_ATANF 1
| #define HAVE_COSF 1
| #define HAVE_EXPF 1
| #define HAVE_FABSF 1
| #define HAVE_FLOORF 1
| #define HAVE_FMODF 1
| #define HAVE_HYPOTF 1
| #define HAVE_LOGF 1
| #define HAVE_POWF 1
| #define HAVE_SINF 1
| #define HAVE_SQRTF 1
| #define HAVE_TANF 1
| #define HAVE_REGEX_H 1
| #define HAVE_STD_COUNT 1
| #define _USE_BZ_API 1
| #define HAVE_NCURSES_H
| #define HAVE_SDL 1
| #define ROBOT 1
| #define SNAPPING 1
| #define INSTALL_DATA_DIR "/usr/local/share/bzflag"
| #define HALF_RATE_AUDIO 1
| #define XF86VIDMODE_EXT 1
| #define NDEBUG 1
| /* end confdefs.h.  */
| 
| int
| main ()
| {
| 
|   ;
|   return 0;
| }
configure:10557: result: no
configure:10597: checking for CGLGetCurrentContext
configure:10654: g++ -o conftest -g -O2 -DBZ_BUILD_DATE=20050830 -ffast-math -fno-exceptions -fsigned-char   -I/usr/X11R6/include -Wall -W -Wshadow -mtune=i686   -L/usr/X11R6/lib conftest.cc -lm -L/usr/lib -lcurl -lidn -lssl -lcrypto -ldl -lssl -lcrypto -ldl -lz  >&5
/home/wili/tmp/ccoxm67e.o(.text+0x14): In function `main':
/home/wili/bzflag/conftest.cc:108: undefined reference to `CGLGetCurrentContext'
/home/wili/tmp/ccoxm67e.o(.data+0x0): undefined reference to `CGLGetCurrentContext'
collect2: ld returned 1 exit status
configure:10660: $? = 1
configure: failed program was:
| /* confdefs.h.  */
| 
| #define PACKAGE_NAME ""
| #define PACKAGE_TARNAME ""
| #define PACKAGE_VERSION ""
| #define PACKAGE_STRING ""
| #define PACKAGE_BUGREPORT ""
| #define PACKAGE "bzflag"
| #define VERSION "2.0.3.20050830"
| #define BZ_BUILD_OS "linux-gnu"
| #define BZ_BUILD_USER "wili"
| #define BUILD_REGEX 1
| #ifdef __cplusplus
| extern "C" void std::exit (int) throw (); using std::exit;
| #endif
| #define STDC_HEADERS 1
| #define HAVE_SYS_TYPES_H 1
| #define HAVE_SYS_STAT_H 1
| #define HAVE_STDLIB_H 1
| #define HAVE_STRING_H 1
| #define HAVE_MEMORY_H 1
| #define HAVE_STRINGS_H 1
| #define HAVE_INTTYPES_H 1
| #define HAVE_STDINT_H 1
| #define HAVE_UNISTD_H 1
| #define HAVE_CSTDLIB 1
| #define HAVE_CSTDIO 1
| #define HAVE_CSTRING 1
| #define HAVE_GL_GLX_H 1
| #define HAVE_SDL_SDL_H 1
| #define HAVE_X11_XLIB_H 1
| #define HAVE_LINUX_INPUT_H 1
| #define HAVE_STDINT_H 1
| #define HAVE_SYS_PARAM_H 1
| #define HAVE_UNISTD_H 1
| #define HAVE_VALUES_H 1
| #define HAVE_SOCKLEN_T 1
| #define HAVE_FF_EFFECT_RUMBLE 1
| #define HAVE_FF_EFFECT_DIRECTIONAL 1
| #define HAVE_LIBM 1
| #define HAVE_ACOSF 1
| #define HAVE_ASINF 1
| #define HAVE_ATAN2F 1
| #define HAVE_ATANF 1
| #define HAVE_COSF 1
| #define HAVE_EXPF 1
| #define HAVE_FABSF 1
| #define HAVE_FLOORF 1
| #define HAVE_FMODF 1
| #define HAVE_HYPOTF 1
| #define HAVE_LOGF 1
| #define HAVE_POWF 1
| #define HAVE_SINF 1
| #define HAVE_SQRTF 1
| #define HAVE_TANF 1
| #define HAVE_REGEX_H 1
| #define HAVE_STD_COUNT 1
| #define _USE_BZ_API 1
| #define HAVE_NCURSES_H
| #define HAVE_SDL 1
| #define ROBOT 1
| #define SNAPPING 1
| #define INSTALL_DATA_DIR "/usr/local/share/bzflag"
| #define HALF_RATE_AUDIO 1
| #define XF86VIDMODE_EXT 1
| #define NDEBUG 1
| /* end confdefs.h.  */
| /* Define CGLGetCurrentContext to an innocuous variant, in case <limits.h> declares CGLGetCurrentContext.
|    For example, HP-UX 11i <limits.h> declares gettimeofday.  */
| #define CGLGetCurrentContext innocuous_CGLGetCurrentContext
| 
| /* System header to define __stub macros and hopefully few prototypes,
|     which can conflict with char CGLGetCurrentContext (); below.
|     Prefer <limits.h> to <assert.h> if __STDC__ is defined, since
|     <limits.h> exists even on freestanding compilers.  */
| 
| #ifdef __STDC__
| # include <limits.h>
| #else
| # include <assert.h>
| #endif
| 
| #undef CGLGetCurrentContext
| 
| /* Override any gcc2 internal prototype to avoid an error.  */
| #ifdef __cplusplus
| extern "C"
| {
| #endif
| /* We use char because int might match the return type of a gcc2
|    builtin and then its argument prototype would still apply.  */
| char CGLGetCurrentContext ();
| /* The GNU C library defines this for functions which it implements
|     to always fail with ENOSYS.  Some functions are actually named
|     something starting with __ and the normal name is an alias.  */
| #if defined (__stub_CGLGetCurrentContext) || defined (__stub___CGLGetCurrentContext)
| choke me
| #else
| char (*f) () = CGLGetCurrentContext;
| #endif
| #ifdef __cplusplus
| }
| #endif
| 
| int
| main ()
| {
| return f != CGLGetCurrentContext;
|   ;
|   return 0;
| }
configure:10685: result: no
configure:10597: checking for Sleep
configure:10654: g++ -o conftest -g -O2 -DBZ_BUILD_DATE=20050830 -ffast-math -fno-exceptions -fsigned-char   -I/usr/X11R6/include -Wall -W -Wshadow -mtune=i686   -L/usr/X11R6/lib conftest.cc -lm -L/usr/lib -lcurl -lidn -lssl -lcrypto -ldl -lssl -lcrypto -ldl -lz  >&5
/home/wili/tmp/ccQXuHFy.o(.text+0x14): In function `main':
/home/wili/bzflag/conftest.cc:108: undefined reference to `Sleep'
/home/wili/tmp/ccQXuHFy.o(.data+0x0): undefined reference to `Sleep'
collect2: ld returned 1 exit status
configure:10660: $? = 1
configure: failed program was:
| /* confdefs.h.  */
| 
| #define PACKAGE_NAME ""
| #define PACKAGE_TARNAME ""
| #define PACKAGE_VERSION ""
| #define PACKAGE_STRING ""
| #define PACKAGE_BUGREPORT ""
| #define PACKAGE "bzflag"
| #define VERSION "2.0.3.20050830"
| #define BZ_BUILD_OS "linux-gnu"
| #define BZ_BUILD_USER "wili"
| #define BUILD_REGEX 1
| #ifdef __cplusplus
| extern "C" void std::exit (int) throw (); using std::exit;
| #endif
| #define STDC_HEADERS 1
| #define HAVE_SYS_TYPES_H 1
| #define HAVE_SYS_STAT_H 1
| #define HAVE_STDLIB_H 1
| #define HAVE_STRING_H 1
| #define HAVE_MEMORY_H 1
| #define HAVE_STRINGS_H 1
| #define HAVE_INTTYPES_H 1
| #define HAVE_STDINT_H 1
| #define HAVE_UNISTD_H 1
| #define HAVE_CSTDLIB 1
| #define HAVE_CSTDIO 1
| #define HAVE_CSTRING 1
| #define HAVE_GL_GLX_H 1
| #define HAVE_SDL_SDL_H 1
| #define HAVE_X11_XLIB_H 1
| #define HAVE_LINUX_INPUT_H 1
| #define HAVE_STDINT_H 1
| #define HAVE_SYS_PARAM_H 1
| #define HAVE_UNISTD_H 1
| #define HAVE_VALUES_H 1
| #define HAVE_SOCKLEN_T 1
| #define HAVE_FF_EFFECT_RUMBLE 1
| #define HAVE_FF_EFFECT_DIRECTIONAL 1
| #define HAVE_LIBM 1
| #define HAVE_ACOSF 1
| #define HAVE_ASINF 1
| #define HAVE_ATAN2F 1
| #define HAVE_ATANF 1
| #define HAVE_COSF 1
| #define HAVE_EXPF 1
| #define HAVE_FABSF 1
| #define HAVE_FLOORF 1
| #define HAVE_FMODF 1
| #define HAVE_HYPOTF 1
| #define HAVE_LOGF 1
| #define HAVE_POWF 1
| #define HAVE_SINF 1
| #define HAVE_SQRTF 1
| #define HAVE_TANF 1
| #define HAVE_REGEX_H 1
| #define HAVE_STD_COUNT 1
| #define _USE_BZ_API 1
| #define HAVE_NCURSES_H
| #define HAVE_SDL 1
| #define ROBOT 1
| #define SNAPPING 1
| #define INSTALL_DATA_DIR "/usr/local/share/bzflag"
| #define HALF_RATE_AUDIO 1
| #define XF86VIDMODE_EXT 1
| #define NDEBUG 1
| /* end confdefs.h.  */
| /* Define Sleep to an innocuous variant, in case <limits.h> declares Sleep.
|    For example, HP-UX 11i <limits.h> declares gettimeofday.  */
| #define Sleep innocuous_Sleep
| 
| /* System header to define __stub macros and hopefully few prototypes,
|     which can conflict with char Sleep (); below.
|     Prefer <limits.h> to <assert.h> if __STDC__ is defined, since
|     <limits.h> exists even on freestanding compilers.  */
| 
| #ifdef __STDC__
| # include <limits.h>
| #else
| # include <assert.h>
| #endif
| 
| #undef Sleep
| 
| /* Override any gcc2 internal prototype to avoid an error.  */
| #ifdef __cplusplus
| extern "C"
| {
| #endif
| /* We use char because int might match the return type of a gcc2
|    builtin and then its argument prototype would still apply.  */
| char Sleep ();
| /* The GNU C library defines this for functions which it implements
|     to always fail with ENOSYS.  Some functions are actually named
|     something starting with __ and the normal name is an alias.  */
| #if defined (__stub_Sleep) || defined (__stub___Sleep)
| choke me
| #else
| char (*f) () = Sleep;
| #endif
| #ifdef __cplusplus
| }
| #endif
| 
| int
| main ()
| {
| return f != Sleep;
|   ;
|   return 0;
| }
configure:10685: result: no
configure:10597: checking for WaitForSingleObject
configure:10654: g++ -o conftest -g -O2 -DBZ_BUILD_DATE=20050830 -ffast-math -fno-exceptions -fsigned-char   -I/usr/X11R6/include -Wall -W -Wshadow -mtune=i686   -L/usr/X11R6/lib conftest.cc -lm -L/usr/lib -lcurl -lidn -lssl -lcrypto -ldl -lssl -lcrypto -ldl -lz  >&5
/home/wili/tmp/ccuSJnPN.o(.text+0x14): In function `main':
/home/wili/bzflag/conftest.cc:108: undefined reference to `WaitForSingleObject'
/home/wili/tmp/ccuSJnPN.o(.data+0x0): undefined reference to `WaitForSingleObject'
collect2: ld returned 1 exit status
configure:10660: $? = 1
configure: failed program was:
| /* confdefs.h.  */
| 
| #define PACKAGE_NAME ""
| #define PACKAGE_TARNAME ""
| #define PACKAGE_VERSION ""
| #define PACKAGE_STRING ""
| #define PACKAGE_BUGREPORT ""
| #define PACKAGE "bzflag"
| #define VERSION "2.0.3.20050830"
| #define BZ_BUILD_OS "linux-gnu"
| #define BZ_BUILD_USER "wili"
| #define BUILD_REGEX 1
| #ifdef __cplusplus
| extern "C" void std::exit (int) throw (); using std::exit;
| #endif
| #define STDC_HEADERS 1
| #define HAVE_SYS_TYPES_H 1
| #define HAVE_SYS_STAT_H 1
| #define HAVE_STDLIB_H 1
| #define HAVE_STRING_H 1
| #define HAVE_MEMORY_H 1
| #define HAVE_STRINGS_H 1
| #define HAVE_INTTYPES_H 1
| #define HAVE_STDINT_H 1
| #define HAVE_UNISTD_H 1
| #define HAVE_CSTDLIB 1
| #define HAVE_CSTDIO 1
| #define HAVE_CSTRING 1
| #define HAVE_GL_GLX_H 1
| #define HAVE_SDL_SDL_H 1
| #define HAVE_X11_XLIB_H 1
| #define HAVE_LINUX_INPUT_H 1
| #define HAVE_STDINT_H 1
| #define HAVE_SYS_PARAM_H 1
| #define HAVE_UNISTD_H 1
| #define HAVE_VALUES_H 1
| #define HAVE_SOCKLEN_T 1
| #define HAVE_FF_EFFECT_RUMBLE 1
| #define HAVE_FF_EFFECT_DIRECTIONAL 1
| #define HAVE_LIBM 1
| #define HAVE_ACOSF 1
| #define HAVE_ASINF 1
| #define HAVE_ATAN2F 1
| #define HAVE_ATANF 1
| #define HAVE_COSF 1
| #define HAVE_EXPF 1
| #define HAVE_FABSF 1
| #define HAVE_FLOORF 1
| #define HAVE_FMODF 1
| #define HAVE_HYPOTF 1
| #define HAVE_LOGF 1
| #define HAVE_POWF 1
| #define HAVE_SINF 1
| #define HAVE_SQRTF 1
| #define HAVE_TANF 1
| #define HAVE_REGEX_H 1
| #define HAVE_STD_COUNT 1
| #define _USE_BZ_API 1
| #define HAVE_NCURSES_H
| #define HAVE_SDL 1
| #define ROBOT 1
| #define SNAPPING 1
| #define INSTALL_DATA_DIR "/usr/local/share/bzflag"
| #define HALF_RATE_AUDIO 1
| #define XF86VIDMODE_EXT 1
| #define NDEBUG 1
| /* end confdefs.h.  */
| /* Define WaitForSingleObject to an innocuous variant, in case <limits.h> declares WaitForSingleObject.
|    For example, HP-UX 11i <limits.h> declares gettimeofday.  */
| #define WaitForSingleObject innocuous_WaitForSingleObject
| 
| /* System header to define __stub macros and hopefully few prototypes,
|     which can conflict with char WaitForSingleObject (); below.
|     Prefer <limits.h> to <assert.h> if __STDC__ is defined, since
|     <limits.h> exists even on freestanding compilers.  */
| 
| #ifdef __STDC__
| # include <limits.h>
| #else
| # include <assert.h>
| #endif
| 
| #undef WaitForSingleObject
| 
| /* Override any gcc2 internal prototype to avoid an error.  */
| #ifdef __cplusplus
| extern "C"
| {
| #endif
| /* We use char because int might match the return type of a gcc2
|    builtin and then its argument prototype would still apply.  */
| char WaitForSingleObject ();
| /* The GNU C library defines this for functions which it implements
|     to always fail with ENOSYS.  Some functions are actually named
|     something starting with __ and the normal name is an alias.  */
| #if defined (__stub_WaitForSingleObject) || defined (__stub___WaitForSingleObject)
| choke me
| #else
| char (*f) () = WaitForSingleObject;
| #endif
| #ifdef __cplusplus
| }
| #endif
| 
| int
| main ()
| {
| return f != WaitForSingleObject;
|   ;
|   return 0;
| }
configure:10685: result: no
configure:10597: checking for _stricmp
configure:10654: g++ -o conftest -g -O2 -DBZ_BUILD_DATE=20050830 -ffast-math -fno-exceptions -fsigned-char   -I/usr/X11R6/include -Wall -W -Wshadow -mtune=i686   -L/usr/X11R6/lib conftest.cc -lm -L/usr/lib -lcurl -lidn -lssl -lcrypto -ldl -lssl -lcrypto -ldl -lz  >&5
/home/wili/tmp/cco7CHU4.o(.text+0x14): In function `main':
/home/wili/bzflag/conftest.cc:108: undefined reference to `_stricmp'
/home/wili/tmp/cco7CHU4.o(.data+0x0): undefined reference to `_stricmp'
collect2: ld returned 1 exit status
configure:10660: $? = 1
configure: failed program was:
| /* confdefs.h.  */
| 
| #define PACKAGE_NAME ""
| #define PACKAGE_TARNAME ""
| #define PACKAGE_VERSION ""
| #define PACKAGE_STRING ""
| #define PACKAGE_BUGREPORT ""
| #define PACKAGE "bzflag"
| #define VERSION "2.0.3.20050830"
| #define BZ_BUILD_OS "linux-gnu"
| #define BZ_BUILD_USER "wili"
| #define BUILD_REGEX 1
| #ifdef __cplusplus
| extern "C" void std::exit (int) throw (); using std::exit;
| #endif
| #define STDC_HEADERS 1
| #define HAVE_SYS_TYPES_H 1
| #define HAVE_SYS_STAT_H 1
| #define HAVE_STDLIB_H 1
| #define HAVE_STRING_H 1
| #define HAVE_MEMORY_H 1
| #define HAVE_STRINGS_H 1
| #define HAVE_INTTYPES_H 1
| #define HAVE_STDINT_H 1
| #define HAVE_UNISTD_H 1
| #define HAVE_CSTDLIB 1
| #define HAVE_CSTDIO 1
| #define HAVE_CSTRING 1
| #define HAVE_GL_GLX_H 1
| #define HAVE_SDL_SDL_H 1
| #define HAVE_X11_XLIB_H 1
| #define HAVE_LINUX_INPUT_H 1
| #define HAVE_STDINT_H 1
| #define HAVE_SYS_PARAM_H 1
| #define HAVE_UNISTD_H 1
| #define HAVE_VALUES_H 1
| #define HAVE_SOCKLEN_T 1
| #define HAVE_FF_EFFECT_RUMBLE 1
| #define HAVE_FF_EFFECT_DIRECTIONAL 1
| #define HAVE_LIBM 1
| #define HAVE_ACOSF 1
| #define HAVE_ASINF 1
| #define HAVE_ATAN2F 1
| #define HAVE_ATANF 1
| #define HAVE_COSF 1
| #define HAVE_EXPF 1
| #define HAVE_FABSF 1
| #define HAVE_FLOORF 1
| #define HAVE_FMODF 1
| #define HAVE_HYPOTF 1
| #define HAVE_LOGF 1
| #define HAVE_POWF 1
| #define HAVE_SINF 1
| #define HAVE_SQRTF 1
| #define HAVE_TANF 1
| #define HAVE_REGEX_H 1
| #define HAVE_STD_COUNT 1
| #define _USE_BZ_API 1
| #define HAVE_NCURSES_H
| #define HAVE_SDL 1
| #define ROBOT 1
| #define SNAPPING 1
| #define INSTALL_DATA_DIR "/usr/local/share/bzflag"
| #define HALF_RATE_AUDIO 1
| #define XF86VIDMODE_EXT 1
| #define NDEBUG 1
| /* end confdefs.h.  */
| /* Define _stricmp to an innocuous variant, in case <limits.h> declares _stricmp.
|    For example, HP-UX 11i <limits.h> declares gettimeofday.  */
| #define _stricmp innocuous__stricmp
| 
| /* System header to define __stub macros and hopefully few prototypes,
|     which can conflict with char _stricmp (); below.
|     Prefer <limits.h> to <assert.h> if __STDC__ is defined, since
|     <limits.h> exists even on freestanding compilers.  */
| 
| #ifdef __STDC__
| # include <limits.h>
| #else
| # include <assert.h>
| #endif
| 
| #undef _stricmp
| 
| /* Override any gcc2 internal prototype to avoid an error.  */
| #ifdef __cplusplus
| extern "C"
| {
| #endif
| /* We use char because int might match the return type of a gcc2
|    builtin and then its argument prototype would still apply.  */
| char _stricmp ();
| /* The GNU C library defines this for functions which it implements
|     to always fail with ENOSYS.  Some functions are actually named
|     something starting with __ and the normal name is an alias.  */
| #if defined (__stub__stricmp) || defined (__stub____stricmp)
| choke me
| #else
| char (*f) () = _stricmp;
| #endif
| #ifdef __cplusplus
| }
| #endif
| 
| int
| main ()
| {
| return f != _stricmp;
|   ;
|   return 0;
| }
configure:10685: result: no
configure:10597: checking for _strnicmp
configure:10654: g++ -o conftest -g -O2 -DBZ_BUILD_DATE=20050830 -ffast-math -fno-exceptions -fsigned-char   -I/usr/X11R6/include -Wall -W -Wshadow -mtune=i686   -L/usr/X11R6/lib conftest.cc -lm -L/usr/lib -lcurl -lidn -lssl -lcrypto -ldl -lssl -lcrypto -ldl -lz  >&5
/home/wili/tmp/ccEtelmm.o(.text+0x14): In function `main':
/home/wili/bzflag/conftest.cc:108: undefined reference to `_strnicmp'
/home/wili/tmp/ccEtelmm.o(.data+0x0): undefined reference to `_strnicmp'
collect2: ld returned 1 exit status
configure:10660: $? = 1
configure: failed program was:
| /* confdefs.h.  */
| 
| #define PACKAGE_NAME ""
| #define PACKAGE_TARNAME ""
| #define PACKAGE_VERSION ""
| #define PACKAGE_STRING ""
| #define PACKAGE_BUGREPORT ""
| #define PACKAGE "bzflag"
| #define VERSION "2.0.3.20050830"
| #define BZ_BUILD_OS "linux-gnu"
| #define BZ_BUILD_USER "wili"
| #define BUILD_REGEX 1
| #ifdef __cplusplus
| extern "C" void std::exit (int) throw (); using std::exit;
| #endif
| #define STDC_HEADERS 1
| #define HAVE_SYS_TYPES_H 1
| #define HAVE_SYS_STAT_H 1
| #define HAVE_STDLIB_H 1
| #define HAVE_STRING_H 1
| #define HAVE_MEMORY_H 1
| #define HAVE_STRINGS_H 1
| #define HAVE_INTTYPES_H 1
| #define HAVE_STDINT_H 1
| #define HAVE_UNISTD_H 1
| #define HAVE_CSTDLIB 1
| #define HAVE_CSTDIO 1
| #define HAVE_CSTRING 1
| #define HAVE_GL_GLX_H 1
| #define HAVE_SDL_SDL_H 1
| #define HAVE_X11_XLIB_H 1
| #define HAVE_LINUX_INPUT_H 1
| #define HAVE_STDINT_H 1
| #define HAVE_SYS_PARAM_H 1
| #define HAVE_UNISTD_H 1
| #define HAVE_VALUES_H 1
| #define HAVE_SOCKLEN_T 1
| #define HAVE_FF_EFFECT_RUMBLE 1
| #define HAVE_FF_EFFECT_DIRECTIONAL 1
| #define HAVE_LIBM 1
| #define HAVE_ACOSF 1
| #define HAVE_ASINF 1
| #define HAVE_ATAN2F 1
| #define HAVE_ATANF 1
| #define HAVE_COSF 1
| #define HAVE_EXPF 1
| #define HAVE_FABSF 1
| #define HAVE_FLOORF 1
| #define HAVE_FMODF 1
| #define HAVE_HYPOTF 1
| #define HAVE_LOGF 1
| #define HAVE_POWF 1
| #define HAVE_SINF 1
| #define HAVE_SQRTF 1
| #define HAVE_TANF 1
| #define HAVE_REGEX_H 1
| #define HAVE_STD_COUNT 1
| #define _USE_BZ_API 1
| #define HAVE_NCURSES_H
| #define HAVE_SDL 1
| #define ROBOT 1
| #define SNAPPING 1
| #define INSTALL_DATA_DIR "/usr/local/share/bzflag"
| #define HALF_RATE_AUDIO 1
| #define XF86VIDMODE_EXT 1
| #define NDEBUG 1
| /* end confdefs.h.  */
| /* Define _strnicmp to an innocuous variant, in case <limits.h> declares _strnicmp.
|    For example, HP-UX 11i <limits.h> declares gettimeofday.  */
| #define _strnicmp innocuous__strnicmp
| 
| /* System header to define __stub macros and hopefully few prototypes,
|     which can conflict with char _strnicmp (); below.
|     Prefer <limits.h> to <assert.h> if __STDC__ is defined, since
|     <limits.h> exists even on freestanding compilers.  */
| 
| #ifdef __STDC__
| # include <limits.h>
| #else
| # include <assert.h>
| #endif
| 
| #undef _strnicmp
| 
| /* Override any gcc2 internal prototype to avoid an error.  */
| #ifdef __cplusplus
| extern "C"
| {
| #endif
| /* We use char because int might match the return type of a gcc2
|    builtin and then its argument prototype would still apply.  */
| char _strnicmp ();
| /* The GNU C library defines this for functions which it implements
|     to always fail with ENOSYS.  Some functions are actually named
|     something starting with __ and the normal name is an alias.  */
| #if defined (__stub__strnicmp) || defined (__stub____strnicmp)
| choke me
| #else
| char (*f) () = _strnicmp;
| #endif
| #ifdef __cplusplus
| }
| #endif
| 
| int
| main ()
| {
| return f != _strnicmp;
|   ;
|   return 0;
| }
configure:10685: result: no
configure:10597: checking for _vsnprintf
configure:10654: g++ -o conftest -g -O2 -DBZ_BUILD_DATE=20050830 -ffast-math -fno-exceptions -fsigned-char   -I/usr/X11R6/include -Wall -W -Wshadow -mtune=i686   -L/usr/X11R6/lib conftest.cc -lm -L/usr/lib -lcurl -lidn -lssl -lcrypto -ldl -lssl -lcrypto -ldl -lz  >&5
/home/wili/tmp/ccstj0tD.o(.text+0x14): In function `main':
/home/wili/bzflag/conftest.cc:108: undefined reference to `_vsnprintf'
/home/wili/tmp/ccstj0tD.o(.data+0x0): undefined reference to `_vsnprintf'
collect2: ld returned 1 exit status
configure:10660: $? = 1
configure: failed program was:
| /* confdefs.h.  */
| 
| #define PACKAGE_NAME ""
| #define PACKAGE_TARNAME ""
| #define PACKAGE_VERSION ""
| #define PACKAGE_STRING ""
| #define PACKAGE_BUGREPORT ""
| #define PACKAGE "bzflag"
| #define VERSION "2.0.3.20050830"
| #define BZ_BUILD_OS "linux-gnu"
| #define BZ_BUILD_USER "wili"
| #define BUILD_REGEX 1
| #ifdef __cplusplus
| extern "C" void std::exit (int) throw (); using std::exit;
| #endif
| #define STDC_HEADERS 1
| #define HAVE_SYS_TYPES_H 1
| #define HAVE_SYS_STAT_H 1
| #define HAVE_STDLIB_H 1
| #define HAVE_STRING_H 1
| #define HAVE_MEMORY_H 1
| #define HAVE_STRINGS_H 1
| #define HAVE_INTTYPES_H 1
| #define HAVE_STDINT_H 1
| #define HAVE_UNISTD_H 1
| #define HAVE_CSTDLIB 1
| #define HAVE_CSTDIO 1
| #define HAVE_CSTRING 1
| #define HAVE_GL_GLX_H 1
| #define HAVE_SDL_SDL_H 1
| #define HAVE_X11_XLIB_H 1
| #define HAVE_LINUX_INPUT_H 1
| #define HAVE_STDINT_H 1
| #define HAVE_SYS_PARAM_H 1
| #define HAVE_UNISTD_H 1
| #define HAVE_VALUES_H 1
| #define HAVE_SOCKLEN_T 1
| #define HAVE_FF_EFFECT_RUMBLE 1
| #define HAVE_FF_EFFECT_DIRECTIONAL 1
| #define HAVE_LIBM 1
| #define HAVE_ACOSF 1
| #define HAVE_ASINF 1
| #define HAVE_ATAN2F 1
| #define HAVE_ATANF 1
| #define HAVE_COSF 1
| #define HAVE_EXPF 1
| #define HAVE_FABSF 1
| #define HAVE_FLOORF 1
| #define HAVE_FMODF 1
| #define HAVE_HYPOTF 1
| #define HAVE_LOGF 1
| #define HAVE_POWF 1
| #define HAVE_SINF 1
| #define HAVE_SQRTF 1
| #define HAVE_TANF 1
| #define HAVE_REGEX_H 1
| #define HAVE_STD_COUNT 1
| #define _USE_BZ_API 1
| #define HAVE_NCURSES_H
| #define HAVE_SDL 1
| #define ROBOT 1
| #define SNAPPING 1
| #define INSTALL_DATA_DIR "/usr/local/share/bzflag"
| #define HALF_RATE_AUDIO 1
| #define XF86VIDMODE_EXT 1
| #define NDEBUG 1
| /* end confdefs.h.  */
| /* Define _vsnprintf to an innocuous variant, in case <limits.h> declares _vsnprintf.
|    For example, HP-UX 11i <limits.h> declares gettimeofday.  */
| #define _vsnprintf innocuous__vsnprintf
| 
| /* System header to define __stub macros and hopefully few prototypes,
|     which can conflict with char _vsnprintf (); below.
|     Prefer <limits.h> to <assert.h> if __STDC__ is defined, since
|     <limits.h> exists even on freestanding compilers.  */
| 
| #ifdef __STDC__
| # include <limits.h>
| #else
| # include <assert.h>
| #endif
| 
| #undef _vsnprintf
| 
| /* Override any gcc2 internal prototype to avoid an error.  */
| #ifdef __cplusplus
| extern "C"
| {
| #endif
| /* We use char because int might match the return type of a gcc2
|    builtin and then its argument prototype would still apply.  */
| char _vsnprintf ();
| /* The GNU C library defines this for functions which it implements
|     to always fail with ENOSYS.  Some functions are actually named
|     something starting with __ and the normal name is an alias.  */
| #if defined (__stub__vsnprintf) || defined (__stub____vsnprintf)
| choke me
| #else
| char (*f) () = _vsnprintf;
| #endif
| #ifdef __cplusplus
| }
| #endif
| 
| int
| main ()
| {
| return f != _vsnprintf;
|   ;
|   return 0;
| }
configure:10685: result: no
configure:10597: checking for atexit
configure:10654: g++ -o conftest -g -O2 -DBZ_BUILD_DATE=20050830 -ffast-math -fno-exceptions -fsigned-char   -I/usr/X11R6/include -Wall -W -Wshadow -mtune=i686   -L/usr/X11R6/lib conftest.cc -lm -L/usr/lib -lcurl -lidn -lssl -lcrypto -ldl -lssl -lcrypto -ldl -lz  >&5
configure:10660: $? = 0
configure:10664: test -z 
			 || test ! -s conftest.err
configure:10667: $? = 0
configure:10670: test -s conftest
configure:10673: $? = 0
configure:10685: result: yes
configure:10597: checking for getrlimit
configure:10654: g++ -o conftest -g -O2 -DBZ_BUILD_DATE=20050830 -ffast-math -fno-exceptions -fsigned-char   -I/usr/X11R6/include -Wall -W -Wshadow -mtune=i686   -L/usr/X11R6/lib conftest.cc -lm -L/usr/lib -lcurl -lidn -lssl -lcrypto -ldl -lssl -lcrypto -ldl -lz  >&5
configure:10660: $? = 0
configure:10664: test -z 
			 || test ! -s conftest.err
configure:10667: $? = 0
configure:10670: test -s conftest
configure:10673: $? = 0
configure:10685: result: yes
configure:10597: checking for glXGetCurrentContext
configure:10654: g++ -o conftest -g -O2 -DBZ_BUILD_DATE=20050830 -ffast-math -fno-exceptions -fsigned-char   -I/usr/X11R6/include -Wall -W -Wshadow -mtune=i686   -L/usr/X11R6/lib conftest.cc -lm -L/usr/lib -lcurl -lidn -lssl -lcrypto -ldl -lssl -lcrypto -ldl -lz  >&5
/home/wili/tmp/cc4j8d8b.o(.text+0x14): In function `main':
/home/wili/bzflag/conftest.cc:110: undefined reference to `glXGetCurrentContext'
/home/wili/tmp/cc4j8d8b.o(.data+0x0): undefined reference to `glXGetCurrentContext'
collect2: ld returned 1 exit status
configure:10660: $? = 1
configure: failed program was:
| /* confdefs.h.  */
| 
| #define PACKAGE_NAME ""
| #define PACKAGE_TARNAME ""
| #define PACKAGE_VERSION ""
| #define PACKAGE_STRING ""
| #define PACKAGE_BUGREPORT ""
| #define PACKAGE "bzflag"
| #define VERSION "2.0.3.20050830"
| #define BZ_BUILD_OS "linux-gnu"
| #define BZ_BUILD_USER "wili"
| #define BUILD_REGEX 1
| #ifdef __cplusplus
| extern "C" void std::exit (int) throw (); using std::exit;
| #endif
| #define STDC_HEADERS 1
| #define HAVE_SYS_TYPES_H 1
| #define HAVE_SYS_STAT_H 1
| #define HAVE_STDLIB_H 1
| #define HAVE_STRING_H 1
| #define HAVE_MEMORY_H 1
| #define HAVE_STRINGS_H 1
| #define HAVE_INTTYPES_H 1
| #define HAVE_STDINT_H 1
| #define HAVE_UNISTD_H 1
| #define HAVE_CSTDLIB 1
| #define HAVE_CSTDIO 1
| #define HAVE_CSTRING 1
| #define HAVE_GL_GLX_H 1
| #define HAVE_SDL_SDL_H 1
| #define HAVE_X11_XLIB_H 1
| #define HAVE_LINUX_INPUT_H 1
| #define HAVE_STDINT_H 1
| #define HAVE_SYS_PARAM_H 1
| #define HAVE_UNISTD_H 1
| #define HAVE_VALUES_H 1
| #define HAVE_SOCKLEN_T 1
| #define HAVE_FF_EFFECT_RUMBLE 1
| #define HAVE_FF_EFFECT_DIRECTIONAL 1
| #define HAVE_LIBM 1
| #define HAVE_ACOSF 1
| #define HAVE_ASINF 1
| #define HAVE_ATAN2F 1
| #define HAVE_ATANF 1
| #define HAVE_COSF 1
| #define HAVE_EXPF 1
| #define HAVE_FABSF 1
| #define HAVE_FLOORF 1
| #define HAVE_FMODF 1
| #define HAVE_HYPOTF 1
| #define HAVE_LOGF 1
| #define HAVE_POWF 1
| #define HAVE_SINF 1
| #define HAVE_SQRTF 1
| #define HAVE_TANF 1
| #define HAVE_REGEX_H 1
| #define HAVE_STD_COUNT 1
| #define _USE_BZ_API 1
| #define HAVE_NCURSES_H
| #define HAVE_SDL 1
| #define ROBOT 1
| #define SNAPPING 1
| #define INSTALL_DATA_DIR "/usr/local/share/bzflag"
| #define HALF_RATE_AUDIO 1
| #define XF86VIDMODE_EXT 1
| #define NDEBUG 1
| #define HAVE_ATEXIT 1
| #define HAVE_GETRLIMIT 1
| /* end confdefs.h.  */
| /* Define glXGetCurrentContext to an innocuous variant, in case <limits.h> declares glXGetCurrentContext.
|    For example, HP-UX 11i <limits.h> declares gettimeofday.  */
| #define glXGetCurrentContext innocuous_glXGetCurrentContext
| 
| /* System header to define __stub macros and hopefully few prototypes,
|     which can conflict with char glXGetCurrentContext (); below.
|     Prefer <limits.h> to <assert.h> if __STDC__ is defined, since
|     <limits.h> exists even on freestanding compilers.  */
| 
| #ifdef __STDC__
| # include <limits.h>
| #else
| # include <assert.h>
| #endif
| 
| #undef glXGetCurrentContext
| 
| /* Override any gcc2 internal prototype to avoid an error.  */
| #ifdef __cplusplus
| extern "C"
| {
| #endif
| /* We use char because int might match the return type of a gcc2
|    builtin and then its argument prototype would still apply.  */
| char glXGetCurrentContext ();
| /* The GNU C library defines this for functions which it implements
|     to always fail with ENOSYS.  Some functions are actually named
|     something starting with __ and the normal name is an alias.  */
| #if defined (__stub_glXGetCurrentContext) || defined (__stub___glXGetCurrentContext)
| choke me
| #else
| char (*f) () = glXGetCurrentContext;
| #endif
| #ifdef __cplusplus
| }
| #endif
| 
| int
| main ()
| {
| return f != glXGetCurrentContext;
|   ;
|   return 0;
| }
configure:10685: result: no
configure:10597: checking for select
configure:10654: g++ -o conftest -g -O2 -DBZ_BUILD_DATE=20050830 -ffast-math -fno-exceptions -fsigned-char   -I/usr/X11R6/include -Wall -W -Wshadow -mtune=i686   -L/usr/X11R6/lib conftest.cc -lm -L/usr/lib -lcurl -lidn -lssl -lcrypto -ldl -lssl -lcrypto -ldl -lz  >&5
configure:10660: $? = 0
configure:10664: test -z 
			 || test ! -s conftest.err
configure:10667: $? = 0
configure:10670: test -s conftest
configure:10673: $? = 0
configure:10685: result: yes
configure:10597: checking for snooze
configure:10654: g++ -o conftest -g -O2 -DBZ_BUILD_DATE=20050830 -ffast-math -fno-exceptions -fsigned-char   -I/usr/X11R6/include -Wall -W -Wshadow -mtune=i686   -L/usr/X11R6/lib conftest.cc -lm -L/usr/lib -lcurl -lidn -lssl -lcrypto -ldl -lssl -lcrypto -ldl -lz  >&5
/home/wili/tmp/ccmB3V9L.o(.text+0x14): In function `main':
/home/wili/bzflag/conftest.cc:111: undefined reference to `snooze'
/home/wili/tmp/ccmB3V9L.o(.data+0x0): undefined reference to `snooze'
collect2: ld returned 1 exit status
configure:10660: $? = 1
configure: failed program was:
| /* confdefs.h.  */
| 
| #define PACKAGE_NAME ""
| #define PACKAGE_TARNAME ""
| #define PACKAGE_VERSION ""
| #define PACKAGE_STRING ""
| #define PACKAGE_BUGREPORT ""
| #define PACKAGE "bzflag"
| #define VERSION "2.0.3.20050830"
| #define BZ_BUILD_OS "linux-gnu"
| #define BZ_BUILD_USER "wili"
| #define BUILD_REGEX 1
| #ifdef __cplusplus
| extern "C" void std::exit (int) throw (); using std::exit;
| #endif
| #define STDC_HEADERS 1
| #define HAVE_SYS_TYPES_H 1
| #define HAVE_SYS_STAT_H 1
| #define HAVE_STDLIB_H 1
| #define HAVE_STRING_H 1
| #define HAVE_MEMORY_H 1
| #define HAVE_STRINGS_H 1
| #define HAVE_INTTYPES_H 1
| #define HAVE_STDINT_H 1
| #define HAVE_UNISTD_H 1
| #define HAVE_CSTDLIB 1
| #define HAVE_CSTDIO 1
| #define HAVE_CSTRING 1
| #define HAVE_GL_GLX_H 1
| #define HAVE_SDL_SDL_H 1
| #define HAVE_X11_XLIB_H 1
| #define HAVE_LINUX_INPUT_H 1
| #define HAVE_STDINT_H 1
| #define HAVE_SYS_PARAM_H 1
| #define HAVE_UNISTD_H 1
| #define HAVE_VALUES_H 1
| #define HAVE_SOCKLEN_T 1
| #define HAVE_FF_EFFECT_RUMBLE 1
| #define HAVE_FF_EFFECT_DIRECTIONAL 1
| #define HAVE_LIBM 1
| #define HAVE_ACOSF 1
| #define HAVE_ASINF 1
| #define HAVE_ATAN2F 1
| #define HAVE_ATANF 1
| #define HAVE_COSF 1
| #define HAVE_EXPF 1
| #define HAVE_FABSF 1
| #define HAVE_FLOORF 1
| #define HAVE_FMODF 1
| #define HAVE_HYPOTF 1
| #define HAVE_LOGF 1
| #define HAVE_POWF 1
| #define HAVE_SINF 1
| #define HAVE_SQRTF 1
| #define HAVE_TANF 1
| #define HAVE_REGEX_H 1
| #define HAVE_STD_COUNT 1
| #define _USE_BZ_API 1
| #define HAVE_NCURSES_H
| #define HAVE_SDL 1
| #define ROBOT 1
| #define SNAPPING 1
| #define INSTALL_DATA_DIR "/usr/local/share/bzflag"
| #define HALF_RATE_AUDIO 1
| #define XF86VIDMODE_EXT 1
| #define NDEBUG 1
| #define HAVE_ATEXIT 1
| #define HAVE_GETRLIMIT 1
| #define HAVE_SELECT 1
| /* end confdefs.h.  */
| /* Define snooze to an innocuous variant, in case <limits.h> declares snooze.
|    For example, HP-UX 11i <limits.h> declares gettimeofday.  */
| #define snooze innocuous_snooze
| 
| /* System header to define __stub macros and hopefully few prototypes,
|     which can conflict with char snooze (); below.
|     Prefer <limits.h> to <assert.h> if __STDC__ is defined, since
|     <limits.h> exists even on freestanding compilers.  */
| 
| #ifdef __STDC__
| # include <limits.h>
| #else
| # include <assert.h>
| #endif
| 
| #undef snooze
| 
| /* Override any gcc2 internal prototype to avoid an error.  */
| #ifdef __cplusplus
| extern "C"
| {
| #endif
| /* We use char because int might match the return type of a gcc2
|    builtin and then its argument prototype would still apply.  */
| char snooze ();
| /* The GNU C library defines this for functions which it implements
|     to always fail with ENOSYS.  Some functions are actually named
|     something starting with __ and the normal name is an alias.  */
| #if defined (__stub_snooze) || defined (__stub___snooze)
| choke me
| #else
| char (*f) () = snooze;
| #endif
| #ifdef __cplusplus
| }
| #endif
| 
| int
| main ()
| {
| return f != snooze;
|   ;
|   return 0;
| }
configure:10685: result: no
configure:10597: checking for usleep
configure:10654: g++ -o conftest -g -O2 -DBZ_BUILD_DATE=20050830 -ffast-math -fno-exceptions -fsigned-char   -I/usr/X11R6/include -Wall -W -Wshadow -mtune=i686   -L/usr/X11R6/lib conftest.cc -lm -L/usr/lib -lcurl -lidn -lssl -lcrypto -ldl -lssl -lcrypto -ldl -lz  >&5
configure:10660: $? = 0
configure:10664: test -z 
			 || test ! -s conftest.err
configure:10667: $? = 0
configure:10670: test -s conftest
configure:10673: $? = 0
configure:10685: result: yes
configure:10597: checking for vsnprintf
configure:10654: g++ -o conftest -g -O2 -DBZ_BUILD_DATE=20050830 -ffast-math -fno-exceptions -fsigned-char   -I/usr/X11R6/include -Wall -W -Wshadow -mtune=i686   -L/usr/X11R6/lib conftest.cc -lm -L/usr/lib -lcurl -lidn -lssl -lcrypto -ldl -lssl -lcrypto -ldl -lz  >&5
configure:10660: $? = 0
configure:10664: test -z 
			 || test ! -s conftest.err
configure:10667: $? = 0
configure:10670: test -s conftest
configure:10673: $? = 0
configure:10685: result: yes
configure:10597: checking for wglGetCurrentContext
configure:10654: g++ -o conftest -g -O2 -DBZ_BUILD_DATE=20050830 -ffast-math -fno-exceptions -fsigned-char   -I/usr/X11R6/include -Wall -W -Wshadow -mtune=i686   -L/usr/X11R6/lib conftest.cc -lm -L/usr/lib -lcurl -lidn -lssl -lcrypto -ldl -lssl -lcrypto -ldl -lz  >&5
/home/wili/tmp/ccKdjwrE.o(.text+0x14): In function `main':
/home/wili/bzflag/conftest.cc:113: undefined reference to `wglGetCurrentContext'
/home/wili/tmp/ccKdjwrE.o(.data+0x0): undefined reference to `wglGetCurrentContext'
collect2: ld returned 1 exit status
configure:10660: $? = 1
configure: failed program was:
| /* confdefs.h.  */
| 
| #define PACKAGE_NAME ""
| #define PACKAGE_TARNAME ""
| #define PACKAGE_VERSION ""
| #define PACKAGE_STRING ""
| #define PACKAGE_BUGREPORT ""
| #define PACKAGE "bzflag"
| #define VERSION "2.0.3.20050830"
| #define BZ_BUILD_OS "linux-gnu"
| #define BZ_BUILD_USER "wili"
| #define BUILD_REGEX 1
| #ifdef __cplusplus
| extern "C" void std::exit (int) throw (); using std::exit;
| #endif
| #define STDC_HEADERS 1
| #define HAVE_SYS_TYPES_H 1
| #define HAVE_SYS_STAT_H 1
| #define HAVE_STDLIB_H 1
| #define HAVE_STRING_H 1
| #define HAVE_MEMORY_H 1
| #define HAVE_STRINGS_H 1
| #define HAVE_INTTYPES_H 1
| #define HAVE_STDINT_H 1
| #define HAVE_UNISTD_H 1
| #define HAVE_CSTDLIB 1
| #define HAVE_CSTDIO 1
| #define HAVE_CSTRING 1
| #define HAVE_GL_GLX_H 1
| #define HAVE_SDL_SDL_H 1
| #define HAVE_X11_XLIB_H 1
| #define HAVE_LINUX_INPUT_H 1
| #define HAVE_STDINT_H 1
| #define HAVE_SYS_PARAM_H 1
| #define HAVE_UNISTD_H 1
| #define HAVE_VALUES_H 1
| #define HAVE_SOCKLEN_T 1
| #define HAVE_FF_EFFECT_RUMBLE 1
| #define HAVE_FF_EFFECT_DIRECTIONAL 1
| #define HAVE_LIBM 1
| #define HAVE_ACOSF 1
| #define HAVE_ASINF 1
| #define HAVE_ATAN2F 1
| #define HAVE_ATANF 1
| #define HAVE_COSF 1
| #define HAVE_EXPF 1
| #define HAVE_FABSF 1
| #define HAVE_FLOORF 1
| #define HAVE_FMODF 1
| #define HAVE_HYPOTF 1
| #define HAVE_LOGF 1
| #define HAVE_POWF 1
| #define HAVE_SINF 1
| #define HAVE_SQRTF 1
| #define HAVE_TANF 1
| #define HAVE_REGEX_H 1
| #define HAVE_STD_COUNT 1
| #define _USE_BZ_API 1
| #define HAVE_NCURSES_H
| #define HAVE_SDL 1
| #define ROBOT 1
| #define SNAPPING 1
| #define INSTALL_DATA_DIR "/usr/local/share/bzflag"
| #define HALF_RATE_AUDIO 1
| #define XF86VIDMODE_EXT 1
| #define NDEBUG 1
| #define HAVE_ATEXIT 1
| #define HAVE_GETRLIMIT 1
| #define HAVE_SELECT 1
| #define HAVE_USLEEP 1
| #define HAVE_VSNPRINTF 1
| /* end confdefs.h.  */
| /* Define wglGetCurrentContext to an innocuous variant, in case <limits.h> declares wglGetCurrentContext.
|    For example, HP-UX 11i <limits.h> declares gettimeofday.  */
| #define wglGetCurrentContext innocuous_wglGetCurrentContext
| 
| /* System header to define __stub macros and hopefully few prototypes,
|     which can conflict with char wglGetCurrentContext (); below.
|     Prefer <limits.h> to <assert.h> if __STDC__ is defined, since
|     <limits.h> exists even on freestanding compilers.  */
| 
| #ifdef __STDC__
| # include <limits.h>
| #else
| # include <assert.h>
| #endif
| 
| #undef wglGetCurrentContext
| 
| /* Override any gcc2 internal prototype to avoid an error.  */
| #ifdef __cplusplus
| extern "C"
| {
| #endif
| /* We use char because int might match the return type of a gcc2
|    builtin and then its argument prototype would still apply.  */
| char wglGetCurrentContext ();
| /* The GNU C library defines this for functions which it implements
|     to always fail with ENOSYS.  Some functions are actually named
|     something starting with __ and the normal name is an alias.  */
| #if defined (__stub_wglGetCurrentContext) || defined (__stub___wglGetCurrentContext)
| choke me
| #else
| char (*f) () = wglGetCurrentContext;
| #endif
| #ifdef __cplusplus
| }
| #endif
| 
| int
| main ()
| {
| return f != wglGetCurrentContext;
|   ;
|   return 0;
| }
configure:10685: result: no
configure:11010: creating ./config.status

## ---------------------- ##
## Running config.status. ##
## ---------------------- ##

This file was extended by config.status, which was
generated by GNU Autoconf 2.59.  Invocation command line was

  CONFIG_FILES    = 
  CONFIG_HEADERS  = 
  CONFIG_LINKS    = 
  CONFIG_COMMANDS = 
  $ ./config.status 

on piko.hoomaha.net

config.status:841: creating bzflag.info
config.status:841: creating bzflag.lsm
config.status:841: creating BZFlag.xcode/Makefile
config.status:841: creating Dev-C++/Makefile
config.status:841: creating Makefile
config.status:841: creating bzflag.spec
config.status:841: creating data/Makefile
config.status:841: creating data/fonts/Makefile
config.status:841: creating data/l10n/Makefile
config.status:841: creating debian/Makefile
config.status:841: creating doc/Makefile
config.status:841: creating doc/faq/Makefile
config.status:841: creating doc/guide/Makefile
config.status:841: creating doc/guide/Commands/Makefile
config.status:841: creating doc/guide/Flags/Makefile
config.status:841: creating doc/guide/Geometry/Makefile
config.status:841: creating doc/guide/Installation/Makefile
config.status:841: creating doc/guide/Tactics/Makefile
config.status:841: creating doc/howto/Makefile
config.status:841: creating doc/man/Makefile
config.status:841: creating include/Makefile
config.status:841: creating misc/Makefile
config.status:841: creating man/Makefile
config.status:841: creating man/bzadmin.6
config.status:841: creating man/bzfs.6
config.status:841: creating man/bzflag.6
config.status:841: creating man/bzw.5
config.status:841: creating package/Makefile
config.status:841: creating package/linux/Makefile
config.status:841: creating package/rpm/Makefile
config.status:841: creating package/irix/Makefile
config.status:841: creating package/win32/Makefile
config.status:841: creating package/win32/nsis/Makefile
config.status:841: creating src/Makefile
config.status:841: creating src/bzadmin/Makefile
config.status:841: creating src/bzflag/Makefile
config.status:841: creating src/bzfs/Makefile
config.status:841: creating src/c-ares/Makefile
config.status:841: creating src/common/Makefile
config.status:841: creating src/date/Makefile
config.status:841: creating src/3D/Makefile
config.status:841: creating src/game/Makefile
config.status:841: creating src/geometry/Makefile
config.status:841: creating src/geometry/models/Makefile
config.status:841: creating src/geometry/models/tank/Makefile
config.status:841: creating src/mediafile/Makefile
config.status:841: creating src/net/Makefile
config.status:841: creating src/obstacle/Makefile
config.status:841: creating src/ogl/Makefile
config.status:841: creating src/platform/Makefile
config.status:841: creating src/platform/MacOSX/BZFlag-Info.plist
config.status:841: creating src/platform/MacOSX/Makefile
config.status:841: creating src/regex/Makefile
config.status:841: creating src/scene/Makefile
config.status:841: creating src/zlib/Makefile
config.status:841: creating tools/Makefile
config.status:841: creating tools/TextTool-W32/Makefile
config.status:841: creating tools/TextTool-W32/res/Makefile
config.status:841: creating tools/bzwtransform/Makefile
config.status:841: creating tools/modeltool/Makefile
config.status:841: creating tools/modeltool/vc71/Makefile
config.status:841: creating win32/Makefile
config.status:841: creating win32/VC6/Makefile
config.status:841: creating win32/VC71/Makefile
config.status:945: creating include/config.h
config.status:1167: include/config.h is unchanged
config.status:1347: executing depfiles commands
configure:12455: result: 
configure:12457: result: BZFlag-2.0.3.20050830 with the following:
configure:12463: result:      curses: -lncurses
configure:12470: result:      SDL
configure:12477: result:      bzadmin
configure:12481: result:      no bzflag client binary!

## ---------------- ##
## Cache variables. ##
## ---------------- ##

ac_cv_build=i686-pc-linux-gnu
ac_cv_build_alias=i686-pc-linux-gnu
ac_cv_c_compiler_gnu=yes
ac_cv_c_const=yes
ac_cv_cxx_compiler_gnu=yes
ac_cv_env_CC_set=
ac_cv_env_CC_value=
ac_cv_env_CFLAGS_set=
ac_cv_env_CFLAGS_value=
ac_cv_env_CPPFLAGS_set=
ac_cv_env_CPPFLAGS_value=
ac_cv_env_CPP_set=
ac_cv_env_CPP_value=
ac_cv_env_CXXCPP_set=
ac_cv_env_CXXCPP_value=
ac_cv_env_CXXFLAGS_set=
ac_cv_env_CXXFLAGS_value=
ac_cv_env_CXX_set=
ac_cv_env_CXX_value=
ac_cv_env_LDFLAGS_set=
ac_cv_env_LDFLAGS_value=
ac_cv_env_build_alias_set=
ac_cv_env_build_alias_value=
ac_cv_env_host_alias_set=
ac_cv_env_host_alias_value=
ac_cv_env_target_alias_set=
ac_cv_env_target_alias_value=
ac_cv_exeext=
ac_cv_func_CGLGetCurrentContext=no
ac_cv_func_Sleep=no
ac_cv_func_WaitForSingleObject=no
ac_cv_func__stricmp=no
ac_cv_func__strnicmp=no
ac_cv_func__vsnprintf=no
ac_cv_func_atexit=yes
ac_cv_func_connect=yes
ac_cv_func_gethostbyname=yes
ac_cv_func_getrlimit=yes
ac_cv_func_glXGetCurrentContext=no
ac_cv_func_remove=yes
ac_cv_func_select=yes
ac_cv_func_shmat=yes
ac_cv_func_snooze=no
ac_cv_func_usleep=yes
ac_cv_func_vsnprintf=yes
ac_cv_func_wglGetCurrentContext=no
ac_cv_have_x='have_x=yes 		ac_x_includes=/usr/X11R6/include ac_x_libraries=/usr/X11R6/lib'
ac_cv_header_GL_glx_h=yes
ac_cv_header_SDL_SDL_h=yes
ac_cv_header_X11_Xlib_h=yes
ac_cv_header_bstring_h=no
ac_cv_header_cstdio=yes
ac_cv_header_cstdlib=yes
ac_cv_header_cstring=yes
ac_cv_header_dsound_h=no
ac_cv_header_inttypes_h=yes
ac_cv_header_linux_input_h=yes
ac_cv_header_memory_h=yes
ac_cv_header_stdc=yes
ac_cv_header_stdint_h=yes
ac_cv_header_stdlib_h=yes
ac_cv_header_string_h=yes
ac_cv_header_strings_h=yes
ac_cv_header_sys_param_h=yes
ac_cv_header_sys_stat_h=yes
ac_cv_header_sys_types_h=yes
ac_cv_header_unistd_h=yes
ac_cv_header_values_h=yes
ac_cv_host=i686-pc-linux-gnu
ac_cv_host_alias=i686-pc-linux-gnu
ac_cv_lib_ICE_IceConnectionNumber=yes
ac_cv_lib_Xext_XextAddDisplay=yes
ac_cv_lib_Xi_XListInputDevices=yes
ac_cv_lib_Xxf86vm_XF86VidModeGetAllModeLines=yes
ac_cv_lib_bind_gethostent=no
ac_cv_lib_cares_ares_init=no
ac_cv_lib_m_acosf=yes
ac_cv_lib_m_asinf=yes
ac_cv_lib_m_atan2f=yes
ac_cv_lib_m_atanf=yes
ac_cv_lib_m_cosf=yes
ac_cv_lib_m_expf=yes
ac_cv_lib_m_fabsf=yes
ac_cv_lib_m_floorf=yes
ac_cv_lib_m_fmodf=yes
ac_cv_lib_m_hypotf=yes
ac_cv_lib_m_logf=yes
ac_cv_lib_m_powf=yes
ac_cv_lib_m_sinf=yes
ac_cv_lib_m_sqrtf=yes
ac_cv_lib_m_tanf=yes
ac_cv_lib_socket_gethostent=no
ac_cv_lib_socket_socket=no
ac_cv_lib_z_compress=yes
ac_cv_objext=o
ac_cv_path_SDL_CONFIG=/usr/local/bin/sdl-config
ac_cv_path_install='/usr/bin/install -c'
ac_cv_prog_AR=ar
ac_cv_prog_AWK=gawk
ac_cv_prog_CPP='gcc -E'
ac_cv_prog_CXXCPP='g++ -E'
ac_cv_prog_HASPOD2MAN=yes
ac_cv_prog_HASWHOAMI=yes
ac_cv_prog_ac_ct_CC=gcc
ac_cv_prog_ac_ct_CXX=g++
ac_cv_prog_ac_ct_RANLIB=ranlib
ac_cv_prog_ac_ct_WINDRES=:
ac_cv_prog_cc_g=yes
ac_cv_prog_cc_stdc=
ac_cv_prog_cxx_g=yes
ac_cv_prog_egrep='grep -E'
ac_cv_prog_make_make_set=yes
ac_cv_search_glBegin=-lGL
ac_cv_search_gluScaleImage=no
ac_cv_target=i686-pc-linux-gnu
ac_cv_target_alias=i686-pc-linux-gnu
ac_cv_type_socklen_t=yes
am_cv_CC_dependencies_compiler_type=gcc3
am_cv_CXX_dependencies_compiler_type=gcc3
mp_cv_ncurses=yes
my_cv_curl_vers=7.13.1

## ----------------- ##
## Output variables. ##
## ----------------- ##

ACLOCAL='${SHELL} /home/wili/bzflag/missing --run aclocal-1.9'
AMDEPBACKSLASH='\'
AMDEP_FALSE='#'
AMDEP_TRUE=''
AMTAR='${SHELL} /home/wili/bzflag/missing --run tar'
AR='ar'
AR_FLAGS=''
AUTOCONF='${SHELL} /home/wili/bzflag/missing --run autoconf'
AUTOHEADER='${SHELL} /home/wili/bzflag/missing --run autoheader'
AUTOMAKE='${SHELL} /home/wili/bzflag/missing --run automake-1.9'
AWK='gawk'
BEOS_FALSE=''
BEOS_TRUE='#'
BUGGY_MIPSPRO_FALSE=''
BUGGY_MIPSPRO_TRUE='#'
BUILDCARES_FALSE='#'
BUILDCARES_TRUE=''
BUILDZLIB_FALSE=''
BUILDZLIB_TRUE='#'
BUILD_REGEX_FALSE='#'
BUILD_REGEX_TRUE=''
BZADMIN_INCLUDED_FALSE='#'
BZADMIN_INCLUDED_TRUE=''
BZFLAG_DATE='2005-08-30'
BZFLAG_VERSION='2.0.3'
CC='gcc'
CCACHE=''
CCDEPMODE='depmode=gcc3'
CFLAGS='-g -O2'
CLIENT_INCLUDED_FALSE=''
CLIENT_INCLUDED_TRUE='#'
CONFIG=''
CPP='gcc -E'
CPPFLAGS='  -I/usr/X11R6/include -Wall -W -Wshadow -mtune=i686'
CURL_CFLAGS=''
CURSES_LIB='-lncurses'
CXX='g++'
CXXCPP='g++ -E'
CXXDEPMODE='depmode=gcc3'
CXXFLAGS='-g -O2 -DBZ_BUILD_DATE=20050830 -ffast-math -fno-exceptions -fsigned-char'
CYGPATH_W='echo'
DEBUG_FALSE=''
DEBUG_TRUE='#'
DEFS='-DHAVE_CONFIG_H'
DEPDIR='.deps'
ECHO_C=''
ECHO_N='-n'
ECHO_T=''
EGREP='grep -E'
EXEEXT=''
GLIBS='-lGL -lXi -lXxf86vm -lXext  -lSM -lICE -lX11  '
HASPOD2MAN='yes'
HASPOD2MAN_FALSE='#'
HASPOD2MAN_TRUE=''
HASWHOAMI='yes'
HAVE_CURSES_FALSE='#'
HAVE_CURSES_TRUE=''
HAVE_KRB5_FALSE=''
HAVE_KRB5_TRUE='#'
HAVE_SDL_FALSE='#'
HAVE_SDL_TRUE=''
INSTALL_DATA='${INSTALL} -m 644'
INSTALL_DATA_DIR='/usr/local/share/bzflag'
INSTALL_PROGRAM='${INSTALL}'
INSTALL_SCRIPT='${INSTALL}'
INSTALL_STRIP_PROGRAM='${SHELL} $(install_sh) -c -s'
IRIX_FALSE=''
IRIX_TRUE='#'
KRB5_CFLAGS=''
KRB5_CONFIG='no'
KRB5_LIBS=''
LDFLAGS='  -L/usr/X11R6/lib'
LIBDIR='$(top_srcdir)/lib'
LIBOBJS=''
LIBS='-lm -L/usr/lib -lcurl -lidn -lssl -lcrypto -ldl -lssl -lcrypto -ldl -lz '
LINUX_FALSE='#'
LINUX_TRUE=''
LN_S='ln -s'
LTLIBOBJS=''
MACOS_FALSE=''
MACOS_TRUE='#'
MAJOR_VERSION='2'
MAKEINFO='${SHELL} /home/wili/bzflag/missing --run makeinfo'
MINOR_VERSION='0'
OBJEXT='o'
PACKAGE='bzflag'
PACKAGE_BUGREPORT=''
PACKAGE_NAME=''
PACKAGE_STRING=''
PACKAGE_TARNAME=''
PACKAGE_VERSION=''
PATH_SEPARATOR=':'
PC_FALSE='#'
PC_TRUE=''
PPC_FALSE=''
PPC_TRUE='#'
RANLIB='ranlib'
SDL_CFLAGS='-I/usr/local/include/SDL -D_REENTRANT'
SDL_CONFIG='/usr/local/bin/sdl-config'
SDL_LIBS='-L/usr/local/lib -Wl,-rpath,/usr/local/lib -lSDL -lpthread'
SET_MAKE=''
SHELL='/bin/sh'
SOLARIS_FALSE=''
SOLARIS_TRUE='#'
STRIP=''
VERSION='2.0.3.20050830'
WIN32_FALSE=''
WIN32_TRUE='#'
WINDRES=':'
WINPORT=''
X_CFLAGS=' -I/usr/X11R6/include'
X_EXTRA_LIBS=''
X_LIBS=' -L/usr/X11R6/lib'
X_PRE_LIBS=' -lSM -lICE'
ac_ct_CC='gcc'
ac_ct_CXX='g++'
ac_ct_RANLIB='ranlib'
ac_ct_STRIP=''
ac_ct_WINDRES=':'
am__fastdepCC_FALSE='#'
am__fastdepCC_TRUE=''
am__fastdepCXX_FALSE='#'
am__fastdepCXX_TRUE=''
am__include='include'
am__leading_dot='.'
am__quote=''
am__tar='${AMTAR} chof - "$$tardir"'
am__untar='${AMTAR} xf -'
bindir='${exec_prefix}/bin'
build='i686-pc-linux-gnu'
build_alias=''
build_cpu='i686'
build_os='linux-gnu'
build_vendor='pc'
datadir='${prefix}/share'
desktopdir='/usr/local/share/applications'
exec_prefix='${prefix}'
host='i686-pc-linux-gnu'
host_alias=''
host_cpu='i686'
host_os='linux-gnu'
host_vendor='pc'
includedir='${prefix}/include'
infodir='${prefix}/info'
install_sh='/home/wili/bzflag/install-sh'
libdir='${exec_prefix}/lib'
libexecdir='${exec_prefix}/libexec'
localstatedir='${prefix}/var'
mandir='${prefix}/man'
mkdir_p='mkdir -p --'
oldincludedir='/usr/include'
prefix='/usr/local'
program_transform_name='s,x,x,'
sbindir='${exec_prefix}/sbin'
sharedstatedir='${prefix}/com'
sysconfdir='${prefix}/etc'
target='i686-pc-linux-gnu'
target_alias=''
target_cpu='i686'
target_os='linux-gnu'
target_vendor='pc'

## ----------- ##
## confdefs.h. ##
## ----------- ##

#define BUILD_REGEX 1
#define BZ_BUILD_OS "linux-gnu"
#define BZ_BUILD_USER "wili"
#define HALF_RATE_AUDIO 1
#define HAVE_ACOSF 1
#define HAVE_ASINF 1
#define HAVE_ATAN2F 1
#define HAVE_ATANF 1
#define HAVE_ATEXIT 1
#define HAVE_COSF 1
#define HAVE_CSTDIO 1
#define HAVE_CSTDLIB 1
#define HAVE_CSTRING 1
#define HAVE_EXPF 1
#define HAVE_FABSF 1
#define HAVE_FF_EFFECT_DIRECTIONAL 1
#define HAVE_FF_EFFECT_RUMBLE 1
#define HAVE_FLOORF 1
#define HAVE_FMODF 1
#define HAVE_GETRLIMIT 1
#define HAVE_GL_GLX_H 1
#define HAVE_HYPOTF 1
#define HAVE_INTTYPES_H 1
#define HAVE_LIBM 1
#define HAVE_LINUX_INPUT_H 1
#define HAVE_LOGF 1
#define HAVE_MEMORY_H 1
#define HAVE_NCURSES_H
#define HAVE_POWF 1
#define HAVE_REGEX_H 1
#define HAVE_SDL 1
#define HAVE_SDL_SDL_H 1
#define HAVE_SELECT 1
#define HAVE_SINF 1
#define HAVE_SOCKLEN_T 1
#define HAVE_SQRTF 1
#define HAVE_STDINT_H 1
#define HAVE_STDINT_H 1
#define HAVE_STDLIB_H 1
#define HAVE_STD_COUNT 1
#define HAVE_STRINGS_H 1
#define HAVE_STRING_H 1
#define HAVE_SYS_PARAM_H 1
#define HAVE_SYS_STAT_H 1
#define HAVE_SYS_TYPES_H 1
#define HAVE_TANF 1
#define HAVE_UNISTD_H 1
#define HAVE_UNISTD_H 1
#define HAVE_USLEEP 1
#define HAVE_VALUES_H 1
#define HAVE_VSNPRINTF 1
#define HAVE_X11_XLIB_H 1
#define INSTALL_DATA_DIR "/usr/local/share/bzflag"
#define NDEBUG 1
#define PACKAGE "bzflag"
#define PACKAGE_BUGREPORT ""
#define PACKAGE_NAME ""
#define PACKAGE_STRING ""
#define PACKAGE_TARNAME ""
#define PACKAGE_VERSION ""
#define ROBOT 1
#define SNAPPING 1
#define STDC_HEADERS 1
#define VERSION "2.0.3.20050830"
#define XF86VIDMODE_EXT 1
#define _USE_BZ_API 1
#endif
#ifdef __cplusplus
extern "C" void std::exit (int) throw (); using std::exit;

configure: exit 0