All pastes #216281 Raw Edit

Unnamed

public text v1 · immutable
#216281 ·published 2006-10-23 01:40 UTC
rendered paste body
------ Build started: Project: tictactoe, Configuration: Debug Win32 ------

Compiling...
tictactoe.cpp
tictactoe.cpp(18) : error C3150: '=' : '__gc' can only be applied to a class, struct, interface, array or pointer
tictactoe.cpp(18) : error C2144: syntax error : 'int' should be preceded by ';'
tictactoe.cpp(18) : error C2513: 'int' : no variable declared before '='
tictactoe.cpp(18) : error C2691: 'System::String' : invalid type for __gc array element
tictactoe.cpp(18) : error C3149: 'System::String' : illegal use of managed type 'System::String'; did you forget a '*'?
tictactoe.cpp(18) : error C2691: 'System::String __gc *' : invalid type for __gc array element
tictactoe.cpp(19) : error C2845: '[' : cannot perform pointer arithmetic on __gc pointer 'System::String __gc *'
tictactoe.cpp(20) : error C2845: '[' : cannot perform pointer arithmetic on __gc pointer 'System::String __gc *'
tictactoe.cpp(21) : error C2845: '[' : cannot perform pointer arithmetic on __gc pointer 'System::String __gc *'
tictactoe.cpp(22) : error C2845: '[' : cannot perform pointer arithmetic on __gc pointer 'System::String __gc *'
tictactoe.cpp(23) : error C2845: '[' : cannot perform pointer arithmetic on __gc pointer 'System::String __gc *'
tictactoe.cpp(24) : error C2845: '[' : cannot perform pointer arithmetic on __gc pointer 'System::String __gc *'
tictactoe.cpp(25) : error C2845: '[' : cannot perform pointer arithmetic on __gc pointer 'System::String __gc *'
tictactoe.cpp(26) : error C2845: '[' : cannot perform pointer arithmetic on __gc pointer 'System::String __gc *'
tictactoe.cpp(27) : error C2845: '[' : cannot perform pointer arithmetic on __gc pointer 'System::String __gc *'
tictactoe.cpp(39) : error C3150: '=' : '__gc' can only be applied to a class, struct, interface, array or pointer
tictactoe.cpp(39) : error C2144: syntax error : 'int' should be preceded by ';'
tictactoe.cpp(39) : error C2513: 'int' : no variable declared before '='
tictactoe.cpp(39) : error C2691: 'System::String' : invalid type for __gc array element
tictactoe.cpp(39) : error C3149: 'System::String' : illegal use of managed type 'System::String'; did you forget a '*'?
tictactoe.cpp(39) : error C2691: 'System::String __gc *' : invalid type for __gc array element
tictactoe.cpp(40) : error C2845: '[' : cannot perform pointer arithmetic on __gc pointer 'System::String __gc *'
tictactoe.cpp(40) : error C2845: '[' : cannot perform pointer arithmetic on __gc pointer 'System::String __gc *'
tictactoe.cpp(41) : error C2845: '[' : cannot perform pointer arithmetic on __gc pointer 'System::String __gc *'
tictactoe.cpp(41) : error C2845: '[' : cannot perform pointer arithmetic on __gc pointer 'System::String __gc *'
tictactoe.cpp(42) : error C2845: '[' : cannot perform pointer arithmetic on __gc pointer 'System::String __gc *'
tictactoe.cpp(42) : error C2845: '[' : cannot perform pointer arithmetic on __gc pointer 'System::String __gc *'
tictactoe.cpp(43) : error C2845: '[' : cannot perform pointer arithmetic on __gc pointer 'System::String __gc *'
tictactoe.cpp(43) : error C2845: '[' : cannot perform pointer arithmetic on __gc pointer 'System::String __gc *'
tictactoe.cpp(44) : error C2845: '[' : cannot perform pointer arithmetic on __gc pointer 'System::String __gc *'
tictactoe.cpp(44) : error C2845: '[' : cannot perform pointer arithmetic on __gc pointer 'System::String __gc *'
tictactoe.cpp(45) : error C2845: '[' : cannot perform pointer arithmetic on __gc pointer 'System::String __gc *'
tictactoe.cpp(45) : error C2845: '[' : cannot perform pointer arithmetic on __gc pointer 'System::String __gc *'
tictactoe.cpp(46) : error C2845: '[' : cannot perform pointer arithmetic on __gc pointer 'System::String __gc *'
tictactoe.cpp(46) : error C2845: '[' : cannot perform pointer arithmetic on __gc pointer 'System::String __gc *'
tictactoe.cpp(47) : error C2845: '[' : cannot perform pointer arithmetic on __gc pointer 'System::String __gc *'
tictactoe.cpp(47) : error C2845: '[' : cannot perform pointer arithmetic on __gc pointer 'System::String __gc *'
tictactoe.cpp(48) : error C2845: '[' : cannot perform pointer arithmetic on __gc pointer 'System::String __gc *'
tictactoe.cpp(48) : error C2845: '[' : cannot perform pointer arithmetic on __gc pointer 'System::String __gc *'
tictactoe.cpp(51) : error C2845: '[' : cannot perform pointer arithmetic on __gc pointer 'System::String __gc *'
tictactoe.cpp(51) : error C2845: '[' : cannot perform pointer arithmetic on __gc pointer 'System::String __gc *'
tictactoe.cpp(51) : error C2845: '[' : cannot perform pointer arithmetic on __gc pointer 'System::String __gc *'
tictactoe.cpp(53) : error C2845: '[' : cannot perform pointer arithmetic on __gc pointer 'System::String __gc *'
tictactoe.cpp(53) : error C2845: '[' : cannot perform pointer arithmetic on __gc pointer 'System::String __gc *'
tictactoe.cpp(53) : error C2845: '[' : cannot perform pointer arithmetic on __gc pointer 'System::String __gc *'
tictactoe.cpp(55) : error C2845: '[' : cannot perform pointer arithmetic on __gc pointer 'System::String __gc *'
tictactoe.cpp(55) : error C2845: '[' : cannot perform pointer arithmetic on __gc pointer 'System::String __gc *'
tictactoe.cpp(55) : error C2845: '[' : cannot perform pointer arithmetic on __gc pointer 'System::String __gc *'

Build log was saved at "file://h:\4th Semester Fall\Comp266\Assignment02\tictactoe\Debug\BuildLog.htm"
tictactoe - 48 error(s), 0 warning(s)


---------------------- Done ----------------------

    Build: 0 succeeded, 1 failed, 0 skipped